Peptide,PTM,ModifiedAA,ModifiedPosition,PeptideUniqueToGene,ExperimentDesc,ExpID,PubmedID,ScoreType,IdentScore,LocProb,Log2FChange,PQ-val,QuantSig,PEP,MassErrorPPM
EDYPQNGGVVR,ph,Y,127,true,"Phosphorylation in N starvation",63,22060019,"MASCOT Score",23.0000000,,,,,,-9.8887700
LASLGSDIAR,ph,S,578,true,"atm and atr DNA damage response",88,25561503,"MASCOT Score",35.0000000,1.0000000,,,,,-0.7100000
LASLGSDIAR,ph,S,578,true,"Tissue atlas Arabidopsis - ProteomicsDB",114,32188942,"MaxQuant score",102.4000000,0.9999980,,,,0.00044697400880978,
LASLGSDIAR,ph,S,581,true,"Tissue atlas Arabidopsis - ProteomicsDB",114,32188942,"MaxQuant score",111.5200000,0.9999640,,,,0.0002093819930451,
LNSQEESSNR,ph,S,670,true,"atm and atr DNA damage response",88,25561503,"MASCOT Score",44.0000000,0.9990000,,,,,-1.8900000
AVMGVIESCKSP,ph,S,929,true,"srk2dei ABA signaling phopshoproteomics",83,23572148,"MASCOT Score",41.0000000,,,,,,-0.0003000
AVMGVIESCKSP,ph,S,929,true,"SnRK2 protein kinase substrates",85,23776212,XCorr,2.1164348,1.0000000,,,,4.3302399717504E-5,
AVMGVIESCKSP,ph,S,929,true,"atm and atr DNA damage response",88,25561503,"MASCOT Score",47.0000000,1.0000000,,,,,-0.9200000
AVMGVIESCKSP,ph,S,929,true,"Tissue atlas Arabidopsis - ProteomicsDB",114,32188942,"MaxQuant score",162.9600000,0.9999250,,,,5.1821702484744E-10,
