Peptide,PTM,ModifiedAA,ModifiedPosition,PeptideUniqueToGene,ExperimentDesc,ExpID,PubmedID,ScoreType,IdentScore,LocProb,Log2FChange,PQ-val,QuantSig,PEP,MassErrorPPM
AVLAMDPQAAE,nt,A,75,true,"Arg/N-end rule seed, prt6 vs. Wt",99,29168982,"MASCOT Score",37.9000000,,0.5408599,0.3459763,NO,0.0016179999802262,-2.0661246
VLAMDPQAAEKFSLD,nt,V,76,true,"HUNTER N-terminome: legumain, GluC and trypsin",119,31951383,"MaxQuant score",69.3490000,,,,,,
VLAMDPQAAE,nt,V,76,true,"N-terminal ChaFRADIC",92,26010716,"MASCOT Score",51.7200000,,,,,0.00015320000238717,
VLAMDPQAAE,nt,V,76,true,"Arg/N-end rule seed, prt6 vs. Wt",99,29168982,"MASCOT Score",61.9200000,,-0.0078857,0.9632091,NO,0.00028350000502542,-1.5021239
VLAMDPQAAEKF,nta,V,76,true,"Arabidopsis translation initiation landscape - NTA",167a,35069635,,,,,,,,
VLAMDPQAAEK,nta,V,76,true,"Characterization plant N-terminal acetylation",6,22223895,"MASCOT Score",55.8300000,,,,,,
VLAMDPQAAE,nta,V,76,true,"HUNTER N-terminome: legumain, GluC and trypsin",119,31951383,"MaxQuant score",102.0600000,,,,,,
TQNFKNSALR,ac,K,146,true,"Quantitative Acetylproteomics",101,29440448,,,,,,,,
NNGQNFHINLPTER,ph,T,201,true,"atm and atr DNA damage response",88,25561503,"MASCOT Score",29.0000000,1.0000000,,,,,-0.5800000
NNGQNFHINLPTER,ph,T,201,true,"Tissue atlas Arabidopsis - ProteomicsDB",114,32188942,"MaxQuant score",233.8400000,1.0000000,,,,0,
KDNSNESPK,ph,S,271,true,"atm and atr DNA damage response",88,25561503,"MASCOT Score",30.0000000,1.0000000,,,,,-0.4200000
KDNSNESPK,ph,S,274,true,"atm and atr DNA damage response",88,25561503,"MASCOT Score",30.0000000,1.0000000,,,,,-1.9800000
SNGTSSSGREEK,ph,T,280,true,"atm and atr DNA damage response",88,25561503,"MASCOT Score",20.0000000,1.0000000,,,,,-0.3100000
HLLDKIADLESEAQK,ac,K,500,true,"Histone deacetylases - apicidin vs control",98a,29061669,"MaxQuant Score",163.6000000,1.0000000,-1.1460000,0.7227698,NO,2.1999998866057E-28,
LHNNTSPDDVVICQALMDYIK,ox,C,643,true,"SPEAR - 50 mM H2O2 / mock",138b,34619326,,,,1.9849214,0.0139365,YES,,
LHNNTSPDDVVICQALMDYIK,sno,C,643,true,"Site-specific nitrosomeproteomic id - gsnor1-3",90b,25699590,XCorr,3.3900000,,,,,6.9749999966007E-5,-5.5600000
AGSAAALSSLVNR,ph,S,919,true,"Tissue atlas Arabidopsis - ProteomicsDB",114,32188942,"MaxQuant score",76.7590000,0.9999930,,,,0.0013323599705473,
YAISSEEFTSDLVGAK,ph,S,1090,true,"Tissue atlas Arabidopsis - ProteomicsDB",114,32188942,"MaxQuant score",203.2000000,0.8135890,,,,0,
