Peptide,PTM,ModifiedAA,ModifiedPosition,PeptideUniqueToGene,ExperimentDesc,ExpID,PubmedID,ScoreType,IdentScore,LocProb,Log2FChange,PQ-val,QuantSig,PEP,MassErrorPPM
MDLIQSYEEE,nta,M,1,true,"Arabidopsis translation initiation landscape - NTA",167a,35069635,,,,,,,,
MDLIQSYEEEDEAVASSPESSPPRMLK,ph,S,16,true,"Brassinosteroid-Regulated Phosphorylation Dynamics",94,26187819,"MaxQuant Score",92.5630000,1.0000000,,,,0.00098450004588813,-1.3090000
MDLIQSYEEEDEAVASSPESSPPR,ph,S,16,true,"TOR Kinase and ABA Receptor",100,29290610,XCorr,4.6839266,0.9638000,,,,0.00012519999290816,
MDLIQSYEEEDEAVASSPESSPPRMLK,ph,S,17,true,"Brassinosteroid-Regulated Phosphorylation Dynamics",94,26187819,"MaxQuant Score",92.5630000,0.9980000,,,,0.00098450004588813,-1.3090000
MDLIQSYEEEDEAVASSPESSPPR,ph,S,17,true,"TOR Kinase and ABA Receptor",100,29290610,XCorr,4.6839266,0.9638000,,,,0.00012519999290816,
MDLIQSYEEEDEAVASSPESSPPRMLK,ph,S,21,true,"Brassinosteroid-Regulated Phosphorylation Dynamics",94,26187819,"MaxQuant Score",92.5630000,0.9450000,,,,0.00098450004588813,-3.5090000
SSAPEVDDTALALTVANVNQSK,ph,S,50,true,"Tissue atlas Arabidopsis - ProteomicsDB",114,32188942,"MaxQuant score",152.0700000,0.9999930,,,,2.4752099855227E-33,
KNDGLSVFNIPQSEQK,ph,S,151,true,"Tissue atlas Arabidopsis - ProteomicsDB",114,32188942,"MaxQuant score",121.4000000,1.0000000,,,,2.6005599451651E-8,
KYAEDHAK,me2,K,212,true,"Arabidopsis protein methylome",123,31809900,"MaxQuant Score",130.6600000,1.0000000,,,,0,-0.0739750
