Peptide,PTM,ModifiedAA,ModifiedPosition,PeptideUniqueToGene,ExperimentDesc,ExpID,PubmedID,ScoreType,IdentScore,LocProb,Log2FChange,PQ-val,QuantSig,PEP,MassErrorPPM
STVSGYEGTGR,nt,S,410,false,"Arg/N-end rule seed, prt6 vs. Wt",99,29168982,"MASCOT Score",36.3800000,,0.3424453,0.1039981,NO,0.038070000708103,-0.4262684
YFEGQLASISEGDDELEVEPSPVRVTEAAAK,ph,S,661,true,"TOR Kinase and ABA Receptor",100,29290610,XCorr,5.1631560,0.9957000,,,,1.9589999283198E-5,
YFEGQLASISEGDDELEVEPSPVRVTEAAAK,ph,S,661,true,"Col-0 callus - FC Col-0 vs. Col-0 Xray",111a,31410901,,49.0700000,,0.6091663,0.0000000,NO,,0.6787030
YFEGQLASISEGDDELEVEPSPVRVTEAAAK,ph,S,661,true,"Col-0 X-ray callus - FC Col-0 vs. Col-0 Xray",111b,31410901,,49.0700000,,0.6091663,0.0000000,NO,,0.6787030
YFEGQLASISEGDDELEVEPSPVRVTEAAAK,ph,S,661,true,"atm callus - FC atm vs. atm Xray",111c,31410901,,49.0700000,,0.5744758,0.0000000,NO,,0.6787030
YFEGQLASISEGDDELEVEPSPVRVTEAAAK,ph,S,661,true,"atm-3 X-ray callus - FC atm vs. atm Xray",111d,31410901,,49.0700000,,0.5744758,0.0000000,NO,,0.6787030
YFEGQLASISEGDDELEVEPSPVRVTEAAAK,ph,S,661,true,"Tissue atlas Arabidopsis - ProteomicsDB",114,32188942,"MaxQuant score",339.0900000,0.9968160,,,,0,
VLEPHKVSVDEDLR,ph,S,936,true,"Tissue atlas Arabidopsis - ProteomicsDB",114,32188942,"MaxQuant score",122.2200000,1.0000000,,,,9.8670598163153E-6,
ISSSGLISIESTK,ph,S,986,true,"Tissue atlas Arabidopsis - ProteomicsDB",114,32188942,"MaxQuant score",119.7700000,0.8514530,,,,6.4957799622789E-5,
