Peptide,PTM,ModifiedAA,ModifiedPosition,PeptideUniqueToGene,ExperimentDesc,ExpID,PubmedID,ScoreType,IdentScore,LocProb,Log2FChange,PQ-val,QuantSig,PEP,MassErrorPPM
ISSLLTSR,ph,S,716,true,"atm and atr DNA damage response",88,25561503,"MASCOT Score",46.0000000,0.9930000,,,,,-0.3700000
ISSLLTSR,ph,S,716,true,"TOR Kinase and ABA Receptor",100,29290610,XCorr,2.8004558,0.8079000,,,,0.019370000809431,
ISSLLTSR,ph,S,716,true,"Tissue atlas Arabidopsis - ProteomicsDB",114,32188942,"MaxQuant score",163.8800000,0.9999670,,,,0.00092053401749581,
VPFFTDDEESSSTPK,ph,T,748,true,"Tissue atlas Arabidopsis - ProteomicsDB",114,32188942,"MaxQuant score",182.5700000,1.0000000,,,,1.0506000231927E-24,
VPFFTDDEESSSTPK,ph,S,753,true,"Large-scale phosphorylation discovery",44,23111157,XCorr,3.4930000,,,,,,
VPFFTDDEESSSTPK,ph,S,753,true,"Lateral root-induction - NAA vs control",106,23328941,"MASCOT Score",42.0000000,,,,,,
VPFFTDDEESSSTPK,ph,S,754,true,"Large-scale phosphorylation discovery",44,23111157,XCorr,4.2360000,,,,,,
VPFFTDDEESSSTPK,ph,S,754,true,"Lateral root-induction - NAA vs control",106,23328941,"MASCOT Score",40.0000000,,0.2862690,0.2717315,NO,,
VPFFTDDEESSSTPKADALFIPR,ph,S,755,true,"Large-scale phosphorylation discovery",44,23111157,XCorr,2.6510000,,,,,,
VPFFTDDEESSSTPK,ph,S,755,true,"Lateral root-induction - NAA vs control",106,23328941,"MASCOT Score",26.0000000,,,,,,
VPFFTDDEESSSTPK,ph,T,756,true,"Lateral root-induction - NAA vs control",106,23328941,"MASCOT Score",22.0000000,,0.2332954,0.3790670,NO,,
VPFFTDDEESSSTPK,ph,T,756,true,"Col-0 callus - FC Col-0 vs. Col-0 Xray",111a,31410901,,68.0500000,,0.5514204,0.0000000,NO,,0.9853179
VPFFTDDEESSSTPK,ph,T,756,true,"Col-0 X-ray callus - FC Col-0 vs. Col-0 Xray",111b,31410901,,68.0500000,,0.5514204,0.0000000,NO,,0.9853179
VPFFTDDEESSSTPK,ph,T,756,true,"atm callus - FC atm vs. atm Xray",111c,31410901,,68.0500000,,0.5807764,0.0000000,NO,,0.9853179
VPFFTDDEESSSTPK,ph,T,756,true,"atm-3 X-ray callus - FC atm vs. atm Xray",111d,31410901,,68.0500000,,0.5807764,0.0000000,NO,,0.9853179
VPFFTDDEESSSTPK,ph,T,756,true,"Tissue atlas Arabidopsis - ProteomicsDB",114,32188942,"MaxQuant score",278.5300000,0.9570560,,,,0,
ALVIRPVQQWSSR,ph,S,781,true,"Tissue atlas Arabidopsis - ProteomicsDB",114,32188942,"MaxQuant score",103.0400000,0.7683990,,,,4.9969199608313E-5,
EQRPTAPLHDNGKSPDMATDAANHDR,ph,S,804,true,"Tissue atlas Arabidopsis - ProteomicsDB",114,32188942,"MaxQuant score",46.6950000,0.9794640,,,,0.00048321101348847,
IHTSVNANQKPNGTTR,ph,S,832,true,"Tissue atlas Arabidopsis - ProteomicsDB",114,32188942,"MaxQuant score",88.9510000,0.9774250,,,,3.7850200897083E-5,
