Peptide,PTM,ModifiedAA,ModifiedPosition,PeptideUniqueToGene,ExperimentDesc,ExpID,PubmedID,ScoreType,IdentScore,LocProb,Log2FChange,PQ-val,QuantSig,PEP,MassErrorPPM
DLKPGNLLVNANCDLK,so,C,170,false,"S-sulfenylation site detection using YAP1C",110,32714340,,,,,,,,
ICDFGLAR,ox,C,175,false,"SPEAR - 50 mM H2O2 / mock",138b,34619326,,,,1.8133062,0.0349409,YES,,
ICDFGLAR,so,C,175,false,"S-sulfenylation site detection using YAP1C",110,32714340,,,,,,,,
GQFMTEYVVTR,ph,T,191,false,"srk2dei ABA signaling phopshoproteomics",83,23572148,"MASCOT Score",72.0000000,,,,,,0.0001000
GQFMTEYVVTR,ph,T,191,false,"atm and atr DNA damage response",88,25561503,"MASCOT Score",46.0000000,1.0000000,,,,,-0.2600000
GQFMTEYVVTR,ph,T,191,false,"Lateral root-induction - NAA vs control",106,23328941,"MASCOT Score",40.0000000,,,,,,
GQFMTEYVVTR,ph,T,191,false,"Tissue atlas Arabidopsis - ProteomicsDB",114,32188942,"MaxQuant score",155.0800000,0.9999920,,,,2.6706700850809E-8,
GQFMTEYVVTR,ph,Y,193,false,"srk2dei ABA signaling phopshoproteomics",83,23572148,"MASCOT Score",72.0000000,,,,,,0.0001000
GQFMTEYVVTR,ph,Y,193,false,"atm and atr DNA damage response",88,25561503,"MASCOT Score",46.0000000,1.0000000,,,,,-0.2600000
GQFMTEYVVTR,ph,Y,193,false,"TOR Kinase and ABA Receptor",100,29290610,XCorr,3.2344706,0.9278000,,,,0.00018099999579135,
GQFMTEYVVTR,ph,Y,193,false,"Tyrosine phosphorylation - flg22 vs mock",105,22074104,"MASCOT Score",39.2000000,,0.2600000,,YES,,
GQFMTEYVVTR,ph,Y,193,false,"Lateral root-induction - NAA vs control",106,23328941,"MASCOT Score",42.0000000,,,,,,
GQFMTEYVVTR,ph,Y,193,false,"Phospho cell culture sucrose/TOR",109,30833711,,,0.9946050,,,,,
GQFMTEYVVTR,ph,Y,193,false,"Tissue atlas Arabidopsis - ProteomicsDB",114,32188942,"MaxQuant score",155.0800000,0.9993930,,,,2.6706700850809E-8,
