Peptide,PTM,ModifiedAA,ModifiedPosition,PeptideUniqueToGene,ExperimentDesc,ExpID,PubmedID,ScoreType,IdentScore,LocProb,Log2FChange,PQ-val,QuantSig,PEP,MassErrorPPM
AFAGTTQKCMACD,nt,A,2,true,"Arg/N-end rule seed, prt6 vs. Wt",99,29168982,"MASCOT Score",56.9900000,,,,,5.4969998330989E-8,-2.8583043
AFAGTTQKCM,nt,A,2,true,"Arg/N-end rule seed, prt6 vs. Wt",99,29168982,"MASCOT Score",30.2900000,,,,,0.19570000469685,0.0378214
AFAGTTQKC,nt,A,2,true,"Arg/N-end rule seed, prt6 vs. Wt",99,29168982,"MASCOT Score",43.1700000,,,,,0.057810001075268,-2.8015992
AFAGTTQKCMACDKTVYLVDKLTADNR,nta,A,2,true,"HUNTER N-terminome: legumain, GluC and trypsin",119,31951383,"MaxQuant score",,,,,,,
AFAGTTQKCMACDKTVYLVDKLTADN,nta,A,2,true,"HUNTER N-terminome: legumain, GluC and trypsin",119,31951383,"MaxQuant score",,,,,,,
AFAGTTQKCMACDKTVY,nta,A,2,true,"Arg/N-end rule pathway Roots",80,25728785,"MASCOT Score",61.8400000,,,,,1.9260000044596E-5,
AFAGTTQKCMACD,nta,A,2,true,"Arg/N-end rule seed, prt6 vs. Wt",99,29168982,"MASCOT Score",56.9900000,,-0.2411088,0.0092324,NO,5.4969998330989E-8,-2.8583043
AFAGTTQKCMACD,nta,A,2,true,"HUNTER N-terminome: legumain, GluC and trypsin",119,31951383,"MaxQuant score",70.9420000,,,,,,
AFAGTTQKCMACD,nta,A,2,true,"Arabidopsis translation initiation landscape - NTA",167a,35069635,,,,,,,,
AFAGTTQKCM,nta,A,2,true,"Arg/N-end rule seed, prt6 vs. Wt",99,29168982,"MASCOT Score",30.2900000,,-0.1949578,0.1966225,NO,0.19570000469685,0.0378214
AFAGTTQKC,nta,A,2,true,"Arg/N-end rule seed, prt6 vs. Wt",99,29168982,"MASCOT Score",43.1700000,,-0.2760015,0.0183072,NO,0.057810001075268,-2.8015992
AFAGTTQK,nta,A,2,true,"Characterization plant N-terminal acetylation",6,22223895,"MASCOT Score",48.4500000,,,,,,
TGSLEKSFEGTPK,ph,S,75,true,"Tissue atlas Arabidopsis - ProteomicsDB",114,32188942,"MaxQuant score",194.0000000,0.9999950,,,,4.0306001054667E-30,
VSNMFGGTREK,mox,M,102,true,"cat2 Methionine oxidation - 1h stress",62a,25693801,"MASCOT Score",45.0000000,,0.1015589,,NO,,
CTHGGCTISPSNYIAHEGK,sno,C,137,true,"hot5-4 / wildtype, FAT-switch S-nitrosoproteome",169,37277371,,,,0.4071778,0.0217343,NO,,
TISPSNYIAHE,nt,T,143,true,"Arg/N-end rule seed, prt6 vs. Wt",99,29168982,"MASCOT Score",63.7700000,,-0.3309250,0.2703298,NO,0.00017470000602771,-1.8911701
CTHGGCTISPSNYIAHEGK,ph,S,145,true,"Tissue atlas Arabidopsis - ProteomicsDB",114,32188942,"MaxQuant score",93.4040000,0.9935740,,,,1.4848900491415E-6,
GNLSQLEGGGENAAK,ph,S,173,true,"Tissue atlas Arabidopsis - ProteomicsDB",114,32188942,"MaxQuant score",147.8300000,1.0000000,,,,1.2685199557438E-8,
