Peptide,PTM,ModifiedAA,ModifiedPosition,PeptideUniqueToGene,ExperimentDesc,ExpID,PubmedID,ScoreType,IdentScore,LocProb,Log2FChange,PQ-val,QuantSig,PEP,MassErrorPPM
EKQLEEAR,ub,K,173,true,"Arabidopsis ubiquitination COFRADIC",40,26744219,"MaxQuant Score",107.5700000,1.0000000,,,,0.0060000000521541,0.0970000
RAPAGFYDTADEDRPADQVK,ph,T,226,true,"Large-scale phosphorylation discovery",44,23111157,XCorr,4.0260000,,,,,,
RAPAGFYDTADEDRPADQVK,ph,T,226,true,"atm and atr DNA damage response",88,25561503,"MASCOT Score",25.0000000,1.0000000,,,,,-0.5300000
RAPAGFYDTADEDRPADQVK,ph,T,226,true,"TOR Kinase and ABA Receptor",100,29290610,XCorr,3.9190948,0.9803000,,,,0.0012390000047162,
APAGFYDTADEDRPADQVK,ph,T,226,true,"Tissue atlas Arabidopsis - ProteomicsDB",114,32188942,"MaxQuant score",221.0400000,1.0000000,,,,0,
FPTTIEELEGKRR,me2,K,248,true,"Arabidopsis protein methylome",123,31809900,"MaxQuant Score",244.1800000,1.0000000,,,,0,-0.3408700
LMLPPPQISDHELEEIAK,ph,S,303,true,"TOR Kinase and ABA Receptor",100,29290610,XCorr,2.0550106,1.0000000,,,,0.0074609997682273,
LMLPPPQISDHELEEIAK,ph,S,303,true,"Tissue atlas Arabidopsis - ProteomicsDB",114,32188942,"MaxQuant score",158.4500000,1.0000000,,,,1.8287499217707E-21,
ALLANYSQTPR,ph,Y,340,true,"Phospho cell culture sucrose/TOR",109,30833711,,,0.7610870,,,,,
ALLANYSQTPR,ph,S,341,true,"STN8 phosphoproteome",38,21768351,"MASCOT Score",50.8700000,,,,,,
ALLANYSQTPR,ph,S,341,true,"atm and atr DNA damage response",88,25561503,"MASCOT Score",46.0000000,0.9970000,,,,,0.0200000
ALLANYSQTPR,ph,S,341,true,"Lateral root-induction - NAA vs control",106,23328941,"MASCOT Score",36.0000000,,,,,,
ALLANYSQTPR,ph,S,341,true,"Phospho cell culture sucrose/TOR",109,30833711,,,0.9945590,,,,,
ALLANYSQTPR,ph,S,341,true,"Tissue atlas Arabidopsis - ProteomicsDB",114,32188942,"MaxQuant score",192.7100000,0.9957760,,,,1.5014800499328E-17,
ALLANYSQTPR,ph,T,343,true,"STN8 phosphoproteome",38,21768351,"MASCOT Score",53.3500000,,,,,,-0.0428883
ALLANYSQTPR,ph,T,343,true,"Chloroplast kinase substrates",60,19376835,"MASCOT Score",46.1400000,,,,,,-0.0124616
ALLANYSQTPR,ph,T,343,true,"atm and atr DNA damage response",88,25561503,"MASCOT Score",46.0000000,1.0000000,,,,,0.0200000
ALLANYSQTPR,ph,T,343,true,"TOR Kinase and ABA Receptor",100,29290610,XCorr,3.4696951,0.9997000,,,,1.918999987538E-5,
ALLANYSQTPR,ph,T,343,true,"Lateral root-induction - NAA vs control",106,23328941,"MASCOT Score",39.0000000,,,,,,
ALLANYSQTPR,ph,T,343,true,"Phospho cell culture sucrose/TOR",109,30833711,,,0.9893920,,,,,
ALLANYSQTPR,ph,T,343,true,"Tissue atlas Arabidopsis - ProteomicsDB",114,32188942,"MaxQuant score",220.8100000,0.9999990,,,,3.6411099147194E-32,
QGMTPMRTPQR,ph,T,353,true,"Tissue atlas Arabidopsis - ProteomicsDB",114,32188942,"MaxQuant score",60.9680000,0.9923690,,,,0.0058512799441814,
LRDSQTPLLGGENPELHPSDFTGVTPR,ph,S,378,true,"TOR Kinase and ABA Receptor",100,29290610,XCorr,4.8511877,1.0000000,,,,0.013039999641478,
LRDSQTPLLGGENPELHPSDFTGVTPR,ph,S,378,true,"Tissue atlas Arabidopsis - ProteomicsDB",114,32188942,"MaxQuant score",138.8400000,1.0000000,,,,1.1574725315323E-42,
LRDSQTPLLGGENPELHPSDFTGVTPR,ph,T,380,true,"TOR Kinase and ABA Receptor",100,29290610,XCorr,4.8511877,1.0000000,,,,0.013039999641478,
LRDSQTPLLGGENPELHPSDFTGVTPR,ph,T,380,true,"Tissue atlas Arabidopsis - ProteomicsDB",114,32188942,"MaxQuant score",138.8400000,1.0000000,,,,1.1574725315323E-42,
LRDSQTPLLGGENPELHPSDFTGVTPR,ph,S,393,true,"TOR Kinase and ABA Receptor",100,29290610,XCorr,5.3627529,0.9774000,,,,8.354000158306E-8,
DSQTPLLGGENPELHPSDFTGVTPR,ph,S,393,true,"Lateral root-induction - NAA vs control",106,23328941,"MASCOT Score",29.0000000,,,,,,
LRDSQTPLLGGENPELHPSDFTGVTPR,ph,T,399,true,"Large-scale phosphorylation discovery",44,23111157,XCorr,5.6900000,,,,,,
LRDSQTPLLGGENPELHPSDFTGVTPR,ph,T,399,true,"TOR Kinase and ABA Receptor",100,29290610,XCorr,4.8511877,0.9625000,,,,0.013039999641478,
LRDSQTPLLGGENPELHPSDFTGVTPR,ph,T,399,true,"Tissue atlas Arabidopsis - ProteomicsDB",114,32188942,"MaxQuant score",196.6400000,0.9996810,,,,0,
KEIQTPNPMLTPSMTPGGAGLTPR,ph,T,407,true,"Phospho cell culture sucrose/TOR",109,30833711,,,0.9998050,,,,,
EIQTPNPMLTPSMTPGGAGLTPR,ph,T,407,true,"atm and atr DNA damage response",88,25561503,"MASCOT Score",71.0000000,1.0000000,,,,,0.2800000
EIQTPNPMLTPSMTPGGAGLTPR,ph,T,407,true,"Tissue atlas Arabidopsis - ProteomicsDB",114,32188942,"MaxQuant score",120.4100000,1.0000000,,,,3.7807000755075E-21,
KEIQTPNPMLTPSMTPGGAGLTPR,ph,T,413,true,"Phospho cell culture sucrose/TOR",109,30833711,,,0.9692330,,,,,
EIQTPNPMLTPSMTPGGAGLTPR,ph,T,413,true,"atm and atr DNA damage response",88,25561503,"MASCOT Score",71.0000000,1.0000000,,,,,0.2800000
EIQTPNPMLTPSMTPGGAGLTPR,ph,T,413,true,"Lateral root-induction - NAA vs control",106,23328941,"MASCOT Score",23.0000000,,,,,,
EIQTPNPMLTPSMTPGGAGLTPR,ph,T,413,true,"Tissue atlas Arabidopsis - ProteomicsDB",114,32188942,"MaxQuant score",109.9400000,0.8758500,,,,2.5306599547814E-16,
EIQTPNPMLTPSMTPGGAGLTPR,ph,S,415,true,"Tissue atlas Arabidopsis - ProteomicsDB",114,32188942,"MaxQuant score",208.1700000,0.8982630,,,,0,
KEIQTPNPMLTPSMTPGGAGLTPR,ph,T,417,true,"Phospho cell culture sucrose/TOR",109,30833711,,,0.9440360,,,,,
EIQTPNPMLTPSMTPGGAGLTPR,ph,T,417,true,"atm and atr DNA damage response",88,25561503,"MASCOT Score",71.0000000,1.0000000,,,,,0.2800000
EIQTPNPMLTPSMTPGGAGLTPR,ph,T,417,true,"Tissue atlas Arabidopsis - ProteomicsDB",114,32188942,"MaxQuant score",193.5300000,0.9692310,,,,0,
GAGLTPRIGL,nta,G,420,true,"Arabidopsis translation initiation landscape - NTA",167a,35069635,,,,,,,,
KKEIQTPNPMLTPSMTPGGAGLTPR,ph,T,424,true,"Tissue atlas Arabidopsis - ProteomicsDB",114,32188942,"MaxQuant score",228.6900000,0.9999300,,,,0,
KEIQTPNPMLTPSMTPGGAGLTPR,ph,T,424,true,"Phospho cell culture sucrose/TOR",109,30833711,,,0.9937410,,,,,
EIQTPNPMLTPSMTPGGAGLTPR,ph,T,424,true,"atm and atr DNA damage response",88,25561503,"MASCOT Score",71.0000000,1.0000000,,,,,0.2800000
EIQTPNPMLTPSMTPGGAGLTPR,ph,T,424,true,"TOR Kinase and ABA Receptor",100,29290610,XCorr,5.6984816,1.0000000,,,,2.8590000056283E-7,
EIQTPNPMLTPSMTPGGAGLTPR,ph,T,424,true,"Lateral root-induction - NAA vs control",106,23328941,"MASCOT Score",23.0000000,,,,,,
IGLTPSRDGSSFSMTPK,ph,T,430,true,"STN8 phosphoproteome",38,21768351,"MASCOT Score",48.7400000,,,,,,
IGLTPSRDGSSFSMTPK,ph,T,430,true,"srk2dei ABA signaling phopshoproteomics",83,23572148,"MASCOT Score",24.0000000,,,,,,-0.0003000
IGLTPSRDGSSFSMTPK,ph,T,430,true,"TOR Kinase and ABA Receptor",100,29290610,XCorr,3.0777004,0.9980000,,,,0.11039999872446,
IGLTPSR,ph,T,430,true,"STN8 phosphoproteome",38,21768351,"MASCOT Score",50.3800000,,,,,,-0.5062770
IGLTPSR,ph,T,430,true,"TOR Kinase and ABA Receptor",100,29290610,XCorr,2.8004870,0.9999000,,,,0.0047709997743368,
IGLTPSR,ph,T,430,true,"Lateral root-induction - NAA vs control",106,23328941,"MASCOT Score",27.0000000,,,,,,
IGLTPSR,ph,T,430,true,"Tissue atlas Arabidopsis - ProteomicsDB",114,32188942,"MaxQuant score",159.2800000,0.9999950,,,,1.4038800300758E-15,
IGLTPSRDGSSFSMTPK,ph,S,436,true,"srk2dei ABA signaling phopshoproteomics",83,23572148,"MASCOT Score",22.0000000,,,,,,-0.0011000
DGSSFSMTPK,ph,S,439,true,"TOR Kinase and ABA Receptor",100,29290610,XCorr,2.1445146,0.8956000,,,,0.038049999624491,
DGSSFSMTPK,ph,S,439,true,"Tissue atlas Arabidopsis - ProteomicsDB",114,32188942,"MaxQuant score",99.8440000,0.9973400,,,,0.0026092000771314,
IGLTPSRDGSSFSMTPK,ph,T,441,true,"srk2dei ABA signaling phopshoproteomics",83,23572148,"MASCOT Score",24.0000000,,,,,,-0.0003000
DGSSFSMTPK,ph,T,441,true,"Tyrosine phosphorylation in Arabidopsis",59,18463617,"MASCOT Score",32.0000000,,,,,,-2.2018221
DGSSFSMTPK,ph,T,441,true,"atm and atr DNA damage response",88,25561503,"MASCOT Score",48.0000000,0.9430000,,,,,-0.7000000
DGSSFSMTPK,ph,T,441,true,"Phospho cell culture sucrose/TOR",109,30833711,,,0.9848220,,,,,
DGSSFSMTPK,ph,T,441,true,"Tissue atlas Arabidopsis - ProteomicsDB",114,32188942,"MaxQuant score",168.0200000,0.9999820,,,,6.2906701714383E-7,
DGSSFSMTPKGTPFR,ub,K,443,true,"Arabidopsis ubiquitination COFRADIC",40,26744219,"MaxQuant Score",61.4440000,1.0000000,,,,4.2599999687809E-6,-0.2160000
GTPFRDELHINEDMDMHESAK,ph,T,445,true,"Tissue atlas Arabidopsis - ProteomicsDB",114,32188942,"MaxQuant score",238.5900000,1.0000000,,,,0,
