Peptide,PTM,ModifiedAA,ModifiedPosition,PeptideUniqueToGene,ExperimentDesc,ExpID,PubmedID,ScoreType,IdentScore,LocProb,Log2FChange,PQ-val,QuantSig,PEP,MassErrorPPM
FTNPSPCNSPVLQR,ph,S,32,true,"STN8 phosphoproteome",38,21768351,"MASCOT Score",57.7800000,,,,,,
FTNPSPCNSPVLQR,ph,S,32,true,"Large-scale phosphorylation discovery",44,23111157,XCorr,2.9620000,,,,,,
FTNPSPCNSPVLQR,ph,S,32,true,"srk2dei ABA signaling phopshoproteomics",83,23572148,"MASCOT Score",49.0000000,,,,,,-0.0008000
FTNPSPCNSPVLQR,ph,S,32,true,"LAXIC - ABA stress",84a,23660473,XCorr,3.2400000,0.9950000,,,,0.0026346500962973,
FTNPSPCNSPVLQR,ph,S,32,true,"LAXIC - mannitol vs control",84b,23660473,XCorr,3.6300000,0.9980000,,,,1.3099999705446E-5,
FTNPSPCNSPVLQR,ph,S,32,true,"SnRK2 protein kinase substrates",85,23776212,XCorr,3.9505396,1.0000000,,,,0.00088137900456786,
FTNPSPCNSPVLQR,ph,S,32,true,"atm and atr DNA damage response",88,25561503,"MASCOT Score",46.0000000,1.0000000,,,,,-0.8600000
FTNPSPCNSPVLQR,ph,S,32,true,"Brassinosteroid-Regulated Phosphorylation Dynamics",94,26187819,"MaxQuant Score",102.3300000,1.0000000,,,,0.0080000003799796,-1.2750000
FTNPSPCNSPVLQR,ph,S,32,true,"TOR Kinase and ABA Receptor",100,29290610,XCorr,3.7137125,1.0000000,,,,0.0005276000010781,
FTNPSPCNSPVLQR,ph,S,32,true,"Lateral root-induction - NAA vs control",106,23328941,"MASCOT Score",24.0000000,,,,,,
FTNPSPCNSPVLQR,ph,S,32,true,"Phospho cell culture sucrose/TOR",109,30833711,,,0.9982300,,,,,
FTNPSPCNSPVLQR,ph,S,32,true,"Col-0 callus - FC Col-0 vs. Col-0 Xray",111a,31410901,,39.1800000,,1.4297126,0.0000000,NO,,1.1217601
FTNPSPCNSPVLQR,ph,S,32,true,"Col-0 X-ray callus - FC Col-0 vs. Col-0 Xray",111b,31410901,,39.1800000,,1.4297126,0.0000000,NO,,1.1217601
FTNPSPCNSPVLQR,ph,S,32,true,"atm callus - FC atm vs. atm Xray",111c,31410901,,39.1800000,,1.0558234,0.0000000,NO,,1.1217601
FTNPSPCNSPVLQR,ph,S,32,true,"atm-3 X-ray callus - FC atm vs. atm Xray",111d,31410901,,39.1800000,,1.0558234,0.0000000,NO,,1.1217601
FTNPSPCNSPVLQR,ph,S,32,true,"Tissue atlas Arabidopsis - ProteomicsDB",114,32188942,"MaxQuant score",208.0500000,1.0000000,,,,2.7633605716485E-42,
FTNPSPCNSPVLQR,ph,S,36,true,"Large-scale phosphorylation discovery",44,23111157,XCorr,3.4890000,,,,,,
FTNPSPCNSPVLQR,ph,S,36,true,"srk2dei ABA signaling phopshoproteomics",83,23572148,"MASCOT Score",31.0000000,,,,,,0.0016000
FTNPSPCNSPVLQR,ph,S,36,true,"LAXIC - mannitol vs control",84b,23660473,XCorr,3.6300000,0.9980000,,,,1.3099999705446E-5,
FTNPSPCNSPVLQR,ph,S,36,true,"SnRK2 protein kinase substrates",85,23776212,XCorr,3.9505396,1.0000000,,,,0.00088137900456786,
FTNPSPCNSPVLQR,ph,S,36,true,"atm and atr DNA damage response",88,25561503,"MASCOT Score",46.0000000,1.0000000,,,,,-0.8600000
FTNPSPCNSPVLQR,ph,S,36,true,"Brassinosteroid-Regulated Phosphorylation Dynamics",94,26187819,"MaxQuant Score",102.3300000,1.0000000,,,,0.0080000003799796,-1.2750000
FTNPSPCNSPVLQR,ph,S,36,true,"TOR Kinase and ABA Receptor",100,29290610,XCorr,3.7137125,1.0000000,,,,0.0005276000010781,
FTNPSPCNSPVLQR,ph,S,36,true,"Lateral root-induction - NAA vs control",106,23328941,"MASCOT Score",24.0000000,,,,,,
FTNPSPCNSPVLQR,ph,S,36,true,"Col-0 callus - FC Col-0 vs. Col-0 Xray",111a,31410901,,39.1800000,,1.4297126,0.0000000,NO,,1.1217601
FTNPSPCNSPVLQR,ph,S,36,true,"Col-0 X-ray callus - FC Col-0 vs. Col-0 Xray",111b,31410901,,39.1800000,,1.4297126,0.0000000,NO,,1.1217601
FTNPSPCNSPVLQR,ph,S,36,true,"atm callus - FC atm vs. atm Xray",111c,31410901,,39.1800000,,1.0558234,0.0000000,NO,,1.1217601
FTNPSPCNSPVLQR,ph,S,36,true,"atm-3 X-ray callus - FC atm vs. atm Xray",111d,31410901,,39.1800000,,1.0558234,0.0000000,NO,,1.1217601
FTNPSPCNSPVLQR,ph,S,36,true,"Tissue atlas Arabidopsis - ProteomicsDB",114,32188942,"MaxQuant score",208.0100000,1.0000000,,,,2.7857813470777E-42,
IQSFCNEK,ph,S,46,true,"atm and atr DNA damage response",88,25561503,"MASCOT Score",49.0000000,1.0000000,,,,,-1.4100000
IQSFCNEK,ph,S,46,true,"Tissue atlas Arabidopsis - ProteomicsDB",114,32188942,"MaxQuant score",134.8400000,1.0000000,,,,0.0026552099734545,
ETDIDHDNHGLMFGLNSEDDIEETDVDHR,ph,S,144,true,"SnRK2 protein kinase substrates",85,23776212,XCorr,4.0774064,0.9110000,,,,0.0014835799811408,
ETDIDHDNHGLMFGLNSEDDIEETDVDHR,ph,S,144,true,"TOR Kinase and ABA Receptor",100,29290610,XCorr,3.2772913,1.0000000,,,,2.9319999157451E-5,
ETDIDHDNHGLMFGLNSEDDIEETDVDHR,ph,S,144,true,"Tissue atlas Arabidopsis - ProteomicsDB",114,32188942,"MaxQuant score",433.4600000,1.0000000,,,,0,
LIFELLENRSR,ph,S,669,true,"Tissue atlas Arabidopsis - ProteomicsDB",114,32188942,"MaxQuant score",147.7300000,1.0000000,,,,5.2661199845261E-8,
ASNSFSSWNLGIPLVQK,ph,S,814,true,"TOR Kinase and ABA Receptor",100,29290610,XCorr,2.5366042,0.8380000,,,,0.0073750000447035,
ASNSFSSWNLGIPLVQK,ph,S,817,true,"TOR Kinase and ABA Receptor",100,29290610,XCorr,2.5366042,0.8587000,,,,0.0073750000447035,
LSSPTGEAEEMEK,ph,S,953,true,"Tyrosine phosphorylation in Arabidopsis",59,18463617,"MASCOT Score",60.0000000,,,,,,-0.9417536
LSSPTGEAEEMEK,ph,S,953,true,"srk2dei ABA signaling phopshoproteomics",83,23572148,"MASCOT Score",53.0000000,,,,,,-0.0007000
LSSPTGEAEEMEK,ph,S,953,true,"LAXIC - ABA stress",84a,23660473,XCorr,2.6100000,0.8860000,,,,0.0096386400982738,
LSSPTGEAEEMEK,ph,S,953,true,"LAXIC - mannitol vs control",84b,23660473,XCorr,2.8700000,0.9300000,,,,4.3800000071315E-7,
LSSPTGEAEEMEK,ph,S,953,true,"SnRK2 protein kinase substrates",85,23776212,XCorr,2.9795294,0.9620000,,,,7.1143498644233E-5,
LSSPTGEAEEMEK,ph,S,953,true,"atm and atr DNA damage response",88,25561503,"MASCOT Score",44.0000000,0.9930000,,,,,0.4300000
LSSPTGEAEEMEK,ph,S,953,true,"TOR Kinase and ABA Receptor",100,29290610,XCorr,3.4058478,0.9948000,,,,0.00025149999419227,
LSSPTGEAEEMEK,ph,S,953,true,"Lateral root-induction - NAA vs control",106,23328941,"MASCOT Score",36.0000000,,,,,,
LSSPTGEAEEMEK,ph,S,953,true,"Phospho cell culture sucrose/TOR",109,30833711,,,0.9994530,,,,,
LSSPTGEAEEMEK,ph,S,953,true,"Tissue atlas Arabidopsis - ProteomicsDB",114,32188942,"MaxQuant score",197.2500000,0.9999880,,,,3.6160900464346E-31,
LSSPTGEAEEMEK,ph,T,955,true,"Tyrosine phosphorylation in Arabidopsis",59,18463617,"MASCOT Score",40.0000000,,,,,,-0.6054129
LSSPTGEAEEMEK,ph,T,955,true,"srk2dei ABA signaling phopshoproteomics",83,23572148,"MASCOT Score",29.0000000,,,,,,0.0002000
