Peptide,PTM,ModifiedAA,ModifiedPosition,PeptideUniqueToGene,ExperimentDesc,ExpID,PubmedID,ScoreType,IdentScore,LocProb,Log2FChange,PQ-val,QuantSig,PEP,MassErrorPPM
KAAEQSAAEVALR,ub,K,68,true,"Arabidopsis ubiquitination COFRADIC",40,26744219,"MaxQuant Score",94.7810000,1.0000000,,,,6.5689999928509E-7,0.4720000
VTQFTCTVEIGGIK,so,C,136,true,"Arabidopsis S-sulfenylation chemoproteomics",108,31578252,"pFind PSM Score",0.2402320,,,,,,-0.6447526
NNLANYNTQLTVLPCEK,sno,C,188,true,"hot5-4 / wildtype, FAT-switch S-nitrosoproteome",169,37277371,,,,,,,,
IETTPNLEPSSCMNGLK,ph,T,252,true,"Tissue atlas Arabidopsis - ProteomicsDB",114,32188942,"MaxQuant score",128.8200000,0.8858410,,,,2.7120798939961E-9,
EAAFGSVETEK,ph,S,271,true,"Tissue atlas Arabidopsis - ProteomicsDB",114,32188942,"MaxQuant score",68.1710000,0.9766480,,,,0.0043432400561869,
EAAFGSVETEK,ph,S,299,true,"Tissue atlas Arabidopsis - ProteomicsDB",114,32188942,"MaxQuant score",68.1710000,0.9766480,,,,0.0043432400561869,
EAAFGSVETEK,ph,S,327,true,"Tissue atlas Arabidopsis - ProteomicsDB",114,32188942,"MaxQuant score",68.1710000,0.9766480,,,,0.0043432400561869,
IETTPNLEPSSCMNGLK,ph,T,336,true,"Tissue atlas Arabidopsis - ProteomicsDB",114,32188942,"MaxQuant score",128.8200000,0.8858410,,,,2.7120798939961E-9,
EAAFGSVETEK,ph,S,355,true,"Tissue atlas Arabidopsis - ProteomicsDB",114,32188942,"MaxQuant score",68.1710000,0.9766480,,,,0.0043432400561869,
EAAFGSVETEK,ph,S,383,true,"Tissue atlas Arabidopsis - ProteomicsDB",114,32188942,"MaxQuant score",68.1710000,0.9766480,,,,0.0043432400561869,
