Peptide,PTM,ModifiedAA,ModifiedPosition,PeptideUniqueToGene,ExperimentDesc,ExpID,PubmedID,ScoreType,IdentScore,LocProb,Log2FChange,PQ-val,QuantSig,PEP,MassErrorPPM
ASESKSYARR,nt,A,2,true,"N-term acetylation drought responses",5,26184543,,,,,,,,
ASESKSYARR,nta,A,2,true,"N-term acetylation drought responses",5,26184543,,,,,,,,
ASESKSYAR,nta,A,2,true,"Arabidopsis translation initiation landscape - NTA",167a,35069635,,,,,,,,
AESCENLPKPGEK,sno,C,36,true,"Site-specific nitrosomeproteomic id - gsnor1-3",90a,25699590,XCorr,2.8046675,,,,,2.6649999199435E-5,-6.3710288
AESCENLPKPGEK,sno,C,36,true,"Site-specific nitrosomeproteomic id - gsnor1-3",90b,25699590,XCorr,2.8700000,,,,,0.00038429998676293,-7.5600000
GANVLLPFGFHCTGMPIK,ox,C,92,true,"OxiTRAQ SA and flg22 responses - SA vs mock",91a,25720653,"MASCOT Score",28.4500000,,1.0496308,0.0100000,YES,,
GANVLLPFGFHCTGMPIK,ox,C,92,true,"OxiTRAQ SA and flg22 responses - flg22 vs mock",91b,25720653,"MASCOT Score",28.4500000,,0.7136958,0.2370000,NO,,
AYGLGCDWR,ox,C,203,true,"Redox kickstart of mitochondria",112,31871212,,,,-1.1795207,0.0097476,YES,,
SFVTTDVNPFFDAFVR,nt,S,208,true,"Arabidopsis translation initiation landscape - NT",167b,35069635,,,,,,,,
YTIFSPLDGQPCADHDR,sno,C,252,true,"Site-specific nitrosomeproteomic id - gsnor1-3",90a,25699590,XCorr,2.8964803,,,,,0.00074849999509752,-4.5420200
YTIFSPLDGQPCADHDR,sno,C,252,true,"Site-specific nitrosomeproteomic id - gsnor1-3",90b,25699590,XCorr,3.3500000,,,,,0.035670001059771,-6.7900000
VCLDLK,sno,C,449,true,"hot5-4 / wildtype, FAT-switch S-nitrosoproteome",169,37277371,,,,,,,,
VCLDLK,so,C,449,true,"Arabidopsis S-sulfenylation chemoproteomics",108,31578252,"pFind PSM Score",0.0876134,,0.8517500,,,,0.2201139
VCLDLK,so,C,449,true,"S-sulfenylation site detection using YAP1C",110,32714340,,,,,,,,
IKSQNDKEK,ac,K,455,true,"Quantitative Acetylproteomics",101,29440448,,,,,,,,
EECLSKMNLYSDETR,nt,E,547,true,"FtsH12 N-terminome: WT / FtsH12 knockdown miRNA",118,33216923,"MaxQuant score",140.5000000,,1.3127785,0.0260622,YES,0,
IAEECLSK,ox,C,549,true,"OxiTRAQ Arabidopsis - 5 mM H2O2 versus control",47,24376095,,,,-1.0267760,0.0211174,YES,,
IAEECLSK,sno,C,549,true,"hot5-4 / wildtype, FAT-switch S-nitrosoproteome",169,37277371,,,,-0.2226284,0.3226863,NO,,
CNGHIMLNSEK,ox,C,705,true,"OxiTRAQ Arabidopsis - 5 mM H2O2 versus control",47,24376095,,,,-1.0524878,0.0084141,YES,,
MSKSTGNFR,ac,K,718,true,"Quantitative Acetylproteomics",101,29440448,,,,,,,,
QSIEEFSATGTR,nt,Q,728,true,"HUNTER N-terminome: legumain, GluC and trypsin",119,31951383,"MaxQuant score",95.4010000,,,,,,
FCLADAGDGVDDANFAFETANAAILR,so,C,741,true,"S-sulfenylation site detection using YAP1C",110,32714340,,,,,,,,
AYKDCLFR,ub,K,812,true,"upl3 mutant / wildtype",168,35926874,"MaxQuant score",87.1810000,1.0000000,1.7945198,0.0874770,NO,0.0061605698429048,0.5777100
LSCGTGGMHHDLLLK,ox,C,838,true,"SPEAR - 10 mM H2O2 / mock",138a,34619326,,,,5.7246218,0.0004708,YES,,
LSCGTGGMHHDLLLK,sno,C,838,true,"Site-specific nitrosomeproteomic id - gsnor1-3",90a,25699590,XCorr,2.6460607,,,,,0.00088319997303188,-3.3393036
LSCGTGGMHHDLLLK,sno,C,838,true,"Site-specific nitrosomeproteomic id - gsnor1-3",90b,25699590,XCorr,3.1500000,,,,,0.0095210000872612,-6.8800000
LSCGTGGMHHDLLLK,so,C,838,true,"Arabidopsis S-sulfenylation chemoproteomics",108,31578252,"pFind PSM Score",0.0291556,,1.0079400,,,,-2.1102384
LIVPICPHFADYVWR,ox,C,863,true,"OxiTRAQ SA and flg22 responses - SA vs mock",91a,25720653,"MASCOT Score",46.1200000,,1.4329594,0.0000000,YES,,
LIVPICPHFADYVWR,ox,C,863,true,"OxiTRAQ SA and flg22 responses - flg22 vs mock",91b,25720653,"MASCOT Score",46.1200000,,1.5109619,0.0050000,YES,,
EGCVLTAGWPPSNEPDLVLK,sno,C,880,true,"hot5-4 / wildtype, FAT-switch S-nitrosoproteome",169,37277371,,,,,,,,
YLQDSIVLMRK,mox,M,910,true,"cat2 Methionine oxidation - 3h stress",62b,25693801,"MASCOT Score",36.0000000,,0.5023432,,NO,,
FDQQTCSFPPDTEMLAELSATLLQEGK,ox,C,969,true,"SPEAR - 50 mM H2O2 / mock",138b,34619326,,,,-1.6581455,0.0268659,YES,,
