Peptide,PTM,ModifiedAA,ModifiedPosition,PeptideUniqueToGene,ExperimentDesc,ExpID,PubmedID,ScoreType,IdentScore,LocProb,Log2FChange,PQ-val,QuantSig,PEP,MassErrorPPM
PAGHGVR,nt,P,2,false,"Arabidopsis translation initiation landscape - NT",167b,35069635,,,,,,,,
KKGYIPLSTYLR,nt,K,21,false,"Arabidopsis translation initiation landscape - NT",167b,35069635,,,,,,,,
IWNVTKR,ac,K,69,false,"Quantitative Acetylproteomics",101,29440448,,,,,,,,
AVGVEVNKQIGNR,ac,K,78,false,"Histone deacetylases - apicidin vs control",98a,29061669,"MaxQuant Score",80.7000000,1.0000000,-0.0600000,0.7079458,NO,1.4999999621068E-5,
AVGVEVNKQIGNR,cr,K,78,false,"Open search Plant PTM Viewer 2.0 - Crotonylation",164c,TBA,,,,,,,,
AVGVEVNKQIGNR,ub,K,78,false,"Arabidopsis ubiquitination COFRADIC",40,26744219,"MaxQuant Score",185.2500000,1.0000000,,,,0,0.2430000
CAEEFKLR,ox,C,101,false,"SPEAR - 50 mM H2O2 / mock",138b,34619326,,,,1.9913716,0.0199963,YES,,
CAEEFK,sno,C,101,false,"hot5-4 / wildtype, FAT-switch S-nitrosoproteome",169,37277371,,,,,,,,
CAEEFKLR,so,C,101,false,"S-sulfenylation site detection using YAP1C",110,32714340,,,,,,,,
CAEEFKLR,ub,K,106,false,"Arabidopsis ubiquitination COFRADIC",40,26744219,"MaxQuant Score",69.8250000,1.0000000,,,,0.026000000536442,-0.2360000
ANGETISTKR,ac,K,129,false,"Quantitative Acetylproteomics",101,29440448,,,,,,,,
GETISTKR,ac,K,129,false,"Quantitative Acetylproteomics",101,29440448,,,,,,,,
GETISTKR,ub,K,129,false,"Arabidopsis ubiquitination COFRADIC",40,26744219,"MaxQuant Score",116.7300000,1.0000000,,,,0.003000000026077,-0.1940000
