Peptide,PTM,ModifiedAA,ModifiedPosition,PeptideUniqueToGene,ExperimentDesc,ExpID,PubmedID,ScoreType,IdentScore,LocProb,Log2FChange,PQ-val,QuantSig,PEP,MassErrorPPM
SGSRPTQSSEGSR,nta,S,2,true,"Arabidopsis translation initiation landscape - NTA",167a,35069635,,,,,,,,
SGSRPTQSSEGSR,ph,S,9,true,"atm and atr DNA damage response",88,25561503,"MASCOT Score",31.0000000,0.9840000,,,,,-0.3100000
ADFEESGSSFDYSTSVR,nt,A,34,true,"Arg/N-end rule seed, prt6 vs. Wt",99,29168982,"MASCOT Score",32.5300000,,-1.2973562,0.3261290,NO,0.084880001842976,-1.9190454
SDKVTTTYLHHIQK,ub,K,65,true,"Protein ubiquitination during photomorphogenesis",3,28461270,,,,,,,,
LIQPFGCLLALDEKTFK,ub,K,92,true,"Protein ubiquitination during photomorphogenesis",3,28461270,,,,,,,,
SLFTAPSASALQKALGFGDVSLLNPILVHCR,ub,K,143,true,"Protein ubiquitination during photomorphogenesis",3,28461270,,,,,,,,
LAAKAITR,ub,K,206,true,"Protein ubiquitination during photomorphogenesis",3,28461270,,,,,,,,
VIYSKLNDLK,ub,K,603,true,"Protein ubiquitination during photomorphogenesis",3,28461270,,,,,,,,
ILQTSALCQKQLSK,ub,K,942,true,"Protein ubiquitination during photomorphogenesis",3,28461270,,,,,,,,
