Peptide,PTM,ModifiedAA,ModifiedPosition,PeptideUniqueToGene,ExperimentDesc,ExpID,PubmedID,ScoreType,IdentScore,LocProb,Log2FChange,PQ-val,QuantSig,PEP,MassErrorPPM
ARKKIREY,nt,A,2,false,"Arabidopsis translation initiation landscape - NT",167b,35069635,,,,,,,,
IREYDSKR,ac,K,12,false,"Quantitative Acetylproteomics",101,29440448,,,,,,,,
LVVKPDMLFGKR,ac,K,65,false,"Quantitative Acetylproteomics",101,29440448,,,,,,,,
GKSGLVALK,ac,K,68,false,"Quantitative Acetylproteomics",101,29440448,,,,,,,,
GKSGLVALK,ph,S,69,false,"atm and atr DNA damage response",88,25561503,"MASCOT Score",31.0000000,1.0000000,,,,,-2.4000000
VLSSTENFIHGLDEK,ph,S,244,true,"Large-scale phosphorylation discovery",44,23111157,XCorr,3.1590000,,,,,,
VLSSTENFIHGLDEK,ph,S,244,true,"TOR Kinase and ABA Receptor",100,29290610,XCorr,4.2940159,0.9989000,,,,1.8329999875277E-5,
VLSSTENFIHGLDEK,ph,S,244,true,"Tissue atlas Arabidopsis - ProteomicsDB",114,32188942,"MaxQuant score",258.9200000,0.9996120,,,,0,
VLSSTENFIHGLDEK,ph,S,245,true,"srk2dei ABA signaling phopshoproteomics",83,23572148,"MASCOT Score",29.0000000,,,,,,-0.0006000
VLSSTENFIHGLDEK,ph,S,245,true,"Tissue atlas Arabidopsis - ProteomicsDB",114,32188942,"MaxQuant score",139.7100000,0.9538330,,,,4.8802399987835E-7,
VVIDCATTDPDGR,sno,C,323,true,"Site-specific nitrosomeproteomic id - gsnor1-3",90a,25699590,XCorr,4.0552878,,,,,2.9709999580518E-5,-6.4841341
VVIDCATTDPDGR,sno,C,323,true,"Site-specific nitrosomeproteomic id - gsnor1-3",90b,25699590,XCorr,3.3200000,,,,,0.00078980001853779,-7.3600000
VVIDCATTDPDGR,sno,C,323,true,"hot5-4 / wildtype, FAT-switch S-nitrosoproteome",169,37277371,,,,,,,,
ALGEELGVPLEVYGPEATMTGICK,sno,C,412,true,"hot5-4 / wildtype, FAT-switch S-nitrosoproteome",169,37277371,,,,,,,,
