Peptide,PTM,ModifiedAA,ModifiedPosition,PeptideUniqueToGene,ExperimentDesc,ExpID,PubmedID,ScoreType,IdentScore,LocProb,Log2FChange,PQ-val,QuantSig,PEP,MassErrorPPM
ALYVSASSE,nt,A,45,true,"N-terminal ChaFRADIC",92,26010716,"MASCOT Score",32.4000000,,,,,0.0026799999177456,
SSEKKILIMGGTR,nt,S,51,true,"Stromal N-terminome",96,26371235,"MASCOT Score",51.9800000,,,,,,
SSEKKILIMGGTR,nt,S,51,true,"FtsH12 N-terminome: WT / FtsH12 knockdown miRNA",118,33216923,"MaxQuant score",56.2470000,,,,,4.6400000428548E-5,
SSEKKILIMGGTR,nt,S,51,true,"HUNTER N-terminome: legumain, GluC and trypsin",119,31951383,"MaxQuant score",108.0600000,,,,,,
GKSPIAK,ac,K,87,true,"Histone deacetylases - apicidin vs control",98a,29061669,"MaxQuant Score",146.6000000,1.0000000,-0.1560000,0.3971915,NO,5.0999999778867E-9,
GKSPIAK,ac,K,87,true,"Histone deacetylases substrates - hda14 vs WT",98e,29061669,"MaxQuant Score",101.5000000,1.0000000,1.3020000,0.0492040,YES,0.0040000001899898,
SPIAKQLPGESDQDFADFSSK,ac,K,92,true,"Histone deacetylases - apicidin vs control",98a,29061669,"MaxQuant Score",86.3000000,1.0000000,-0.2810000,0.2864178,NO,2.1999999599842E-9,
SPIAKQLPGESDQDFADFSSK,ac,K,92,true,"Histone deacetylases substrates - TSA vs control",98b,29061669,"MaxQuant Score",86.3000000,1.0000000,0.8260000,0.4819478,NO,2.1999999599842E-9,
SPIAKQLPGESDQDFADFSSK,ac,K,92,true,"Histone deacetylases- hda14 vs WT (low light)",98c,29061669,"MaxQuant Score",131.5600000,1.0000000,-0.1990000,0.9885531,NO,4.1000000616798E-10,
SPIAKQLPGESDQDFADFSSK,ac,K,92,true,"Histone deacetylases substrates - hda14 vs WT",98e,29061669,"MaxQuant Score",97.7000000,1.0000000,0.2180000,0.7925013,NO,2.0000000916274E-18,
QLPGESDQDFADFSSK,ph,S,98,true,"srk2dei ABA signaling phopshoproteomics",83,23572148,"MASCOT Score",32.0000000,,,,,,0.0004000
QLPGESDQDFADFSSKILHLK,ac,K,108,true,"Histone deacetylases substrates - TSA vs control",98b,29061669,"MaxQuant Score",46.0000000,1.0000000,0.1650000,0.9977001,NO,0.00018000000272878,
ILHLKGDR,ac,K,113,true,"Histone deacetylases - apicidin vs control",98a,29061669,"MaxQuant Score",73.3000000,1.0000000,-0.1070000,0.5333349,NO,0.014999999664724,
ILHLKGDR,ac,K,113,true,"Histone deacetylases substrates - TSA vs control",98b,29061669,"MaxQuant Score",73.3000000,1.0000000,-0.2450000,0.9794900,NO,0.014999999664724,
SSLSAEGFDVVYDINGR,ph,S,127,true,"srk2dei ABA signaling phopshoproteomics",83,23572148,"MASCOT Score",32.0000000,,,,,,0.0025000
LEQYIYCSSAGVYLK,ox,C,161,true,"Redox kickstart of mitochondria",112,31871212,,,,-1.0078409,0.0021596,YES,,
SDILPHCEEDAVDPK,sno,C,176,true,"Site-specific nitrosomeproteomic id - gsnor1-3",90a,25699590,XCorr,2.6764951,,,,,8.1279998994432E-5,-5.1431558
SDILPHCEEDAVDPK,sno,C,176,true,"Site-specific nitrosomeproteomic id - gsnor1-3",90b,25699590,XCorr,2.6600000,,,,,0.064290001988411,-5.8100000
SDILPHCEEDAVDPKSR,ac,K,184,true,"Histone deacetylases substrates - TSA vs control",98b,29061669,"MaxQuant Score",110.7000000,1.0000000,0.1120000,0.9977001,NO,4.9999998413276E-20,
SDILPHCEEDAVDPKSR,ac,K,184,true,"Histone deacetylases- hda14 vs WT (low light)",98c,29061669,"MaxQuant Score",220.4200000,1.0000000,-0.1980000,0.9885531,NO,2.0999999917333E-24,
SDILPHCEEDAVDPKSR,ac,K,184,true,"Histone deacetylases - hda14 vs WT (thylakoids)",98d,29061669,"MaxQuant Score",83.4000000,1.0000000,-0.5750000,0.6966265,NO,1.3200000203994E-8,
SDILPHCEEDAVDPKSR,ac,K,184,true,"Histone deacetylases substrates - hda14 vs WT",98e,29061669,"MaxQuant Score",208.5000000,1.0000000,-0.0470000,0.9289664,NO,0,
GKLETESLLQSK,ac,K,190,true,"Histone deacetylases - apicidin vs control",98a,29061669,"MaxQuant Score",144.8000000,1.0000000,-0.0480000,0.7673615,NO,1.4999999525017E-15,
GKLETESLLQSK,ac,K,190,true,"Histone deacetylases substrates - TSA vs control",98b,29061669,"MaxQuant Score",144.8000000,1.0000000,0.2520000,0.9794900,NO,1.4999999525017E-15,
GKLETESLLQSK,ac,K,190,true,"Histone deacetylases- hda14 vs WT (low light)",98c,29061669,"MaxQuant Score",230.3600000,1.0000000,-0.3610000,0.9885531,NO,1.7000000379305E-14,
GKLETESLLQSK,ac,K,190,true,"Histone deacetylases - hda14 vs WT (thylakoids)",98d,29061669,"MaxQuant Score",79.9000000,1.0000000,0.0570000,0.9954054,NO,0.00064699997892603,
GKLETESLLQSK,ac,K,190,true,"Histone deacetylases substrates - hda14 vs WT",98e,29061669,"MaxQuant Score",214.2000000,1.0000000,0.0800000,0.9120108,NO,0,
GKLETESLLQSK,ph,S,195,true,"atm and atr DNA damage response",88,25561503,"MASCOT Score",41.0000000,1.0000000,,,,,-1.2900000
LETESLLQSK,ph,S,195,true,"Tissue atlas Arabidopsis - ProteomicsDB",114,32188942,"MaxQuant score",155.4700000,0.9993450,,,,8.983880093183E-7,
GKLETESLLQSK,ph,S,199,true,"atm and atr DNA damage response",88,25561503,"MASCOT Score",45.0000000,1.0000000,,,,,-1.1000000
GKLETESLLQSK,ph,S,199,true,"Tissue atlas Arabidopsis - ProteomicsDB",114,32188942,"MaxQuant score",140.9600000,0.9999990,,,,1.1286099834251E-5,
LETESLLQSK,ph,S,199,true,"STN8 phosphoproteome",38,21768351,"MASCOT Score",47.3800000,,,,,,-0.2908870
GKLETESLLQSK,ac,K,200,true,"Quantitative Acetylproteomics",101,29440448,,,,,,,,
DLATAFLNVLGNEKASR,ac,K,265,true,"Histone deacetylases substrates - hda14 vs WT",98e,29061669,"MaxQuant Score",146.3000000,1.0000000,0.0110000,0.9931160,NO,3.3631163143796E-44,
EIFNISGEKYVTFDGLAK,ac,K,277,true,"Histone deacetylases substrates - hda14 vs WT",98e,29061669,"MaxQuant Score",102.6000000,1.0000000,-1.1390000,0.0722770,NO,2.3000000123137E-17,
AKAGGFPEPE,nt,A,289,true,"Arg/N-end rule seed, prt6 vs. Wt",99,29168982,"MASCOT Score",32.0200000,,-0.8657140,0.0006655,NO,0.0035900000948459,-1.7728296
AGGFPEPEIVHYNPKEFDFGK,ac,K,305,true,"Histone deacetylases - apicidin vs control",98a,29061669,"MaxQuant Score",160.3000000,1.0000000,-0.1110000,0.5357967,NO,0,
AGGFPEPEIVHYNPKEFDFGK,ac,K,305,true,"Histone deacetylases substrates - TSA vs control",98b,29061669,"MaxQuant Score",160.3000000,1.0000000,0.2010000,0.9772372,NO,0,
AGGFPEPEIVHYNPKEFDFGK,ac,K,305,true,"Histone deacetylases- hda14 vs WT (low light)",98c,29061669,"MaxQuant Score",194.2400000,1.0000000,-0.1200000,0.9885531,NO,7.3999999473917E-25,
AGGFPEPEIVHYNPKEFDFGK,ac,K,305,true,"Histone deacetylases - hda14 vs WT (thylakoids)",98d,29061669,"MaxQuant Score",71.9000000,1.0000000,0.2470000,0.8892011,NO,1.4900000344653E-8,
AGGFPEPEIVHYNPKEFDFGK,ac,K,305,true,"Histone deacetylases substrates - hda14 vs WT",98e,29061669,"MaxQuant Score",202.4000000,1.0000000,-0.0030000,0.9954054,NO,0,
EFDFGKKK,ac,K,311,true,"Quantitative Acetylproteomics",101,29440448,,,,,,,,
EFDFGKK,ac,K,311,true,"Histone deacetylases - apicidin vs control",98a,29061669,"MaxQuant Score",114.8000000,1.0000000,0.0550000,0.8072350,NO,0.014999999664724,
EFDFGKK,ac,K,311,true,"Histone deacetylases substrates - TSA vs control",98b,29061669,"MaxQuant Score",114.8000000,1.0000000,-0.0460000,0.9977001,NO,0.014999999664724,
EFDFGKK,ac,K,311,true,"Histone deacetylases substrates - hda14 vs WT",98e,29061669,"MaxQuant Score",127.1000000,1.0000000,0.0670000,0.9120108,NO,2.3999999143598E-7,
EFDFGKK,ac,K,311,true,"Quantitative Acetylproteomics",101,29440448,,,,,,,,
DQHFFASVEK,ph,S,325,true,"atm and atr DNA damage response",88,25561503,"MASCOT Score",34.0000000,1.0000000,,,,,-0.9600000
DQHFFASVEKAK,ac,K,328,true,"Histone deacetylases - apicidin vs control",98a,29061669,"MaxQuant Score",84.2000000,1.0000000,-0.0680000,0.8035261,NO,0.00095000001601875,
DQHFFASVEKAK,ac,K,328,true,"Quantitative Acetylproteomics",101,29440448,,,,,,,,
KEADFTTDDMILSK,ac,K,360,true,"Histone deacetylases - apicidin vs control",98a,29061669,"MaxQuant Score",151.1000000,1.0000000,-0.1830000,0.3176874,NO,1.8999999397045E-20,
KEADFTTDDMILSK,ac,K,360,true,"Histone deacetylases- hda14 vs WT (low light)",98c,29061669,"MaxQuant Score",192.9600000,1.0000000,0.4270000,0.9885531,NO,2.600000022137E-13,
EADFTTDDMILSK,mox,M,369,true,"cat2 Methionine oxidation - 1h stress",62a,25693801,"MASCOT Score",48.0000000,,-0.0011142,,NO,,
EADFTTDDMILSK,mox,M,369,true,"cat2 Methionine oxidation - 3h stress",62b,25693801,"MASCOT Score",37.0000000,,-0.3117814,,NO,,
KEADFTTDDMILSKK,ac,K,373,true,"Quantitative Acetylproteomics",101,29440448,,,,,,,,
EADFTTDDMILSKK,ac,K,373,true,"Quantitative Acetylproteomics",101,29440448,,,,,,,,
