Peptide,PTM,ModifiedAA,ModifiedPosition,PeptideUniqueToGene,ExperimentDesc,ExpID,PubmedID,ScoreType,IdentScore,LocProb,Log2FChange,PQ-val,QuantSig,PEP,MassErrorPPM
GLVTEEVRAK,nt,G,2,true,"N-term acetylation drought responses",5,26184543,,,,,,,,
GLVTEEVR,nt,G,2,true,"Tic56 chloroplast import - tic56-1",89c,25588737,XCorr,3.0774739,,,,,,
GLVTEEVR,nt,G,2,true,"Stromal N-terminome",96,26371235,"MASCOT Score",62.4400000,,,,,,
GLVTEEVR,nt,G,2,true,"Arg/N-end rule seed, prt6 vs. Wt",99,29168982,"MASCOT Score",59.3700000,,-0.0385319,0.7758031,NO,0.18230000138283,0.1525786
GLVTEEVRAK,nta,G,2,true,"N-term acetylation drought responses",5,26184543,,,,,,,,
GLVTEEVR,nta,G,2,true,"Characterization plant N-terminal acetylation",6,22223895,"MASCOT Score",58.1200000,,,,,,
GLVTEEVR,nta,G,2,true,"Stromal N-terminome",96,26371235,"MASCOT Score",62.4400000,,,,,,
GLVTEEVR,nta,G,2,true,"Arg/N-end rule seed, prt6 vs. Wt",99,29168982,"MASCOT Score",59.3700000,,,,,0.18230000138283,0.1525786
GLVTEEVR,nta,G,2,true,"FtsH12 N-terminome: WT / FtsH12 knockdown miRNA",118,33216923,"MaxQuant score",196.3200000,,,,,1.2599999729393E-18,
AKAEMYTGDEICR,nt,A,10,true,"Tic56 chloroplast import - tic56-1",89c,25588737,XCorr,4.6752238,,,,,,
AKAEMYTGDEICR,nt,A,10,true,"Arg/N-end rule seed, prt6 vs. Wt",99,29168982,"MASCOT Score",21.0200000,,-0.8036006,0.0010656,NO,0.029529999941587,-1.3974870
AKAEMYTGDEICR,nta,A,10,true,"FtsH12 N-terminome: WT / FtsH12 knockdown miRNA",118,33216923,"MaxQuant score",94.5510000,,,,,0.00069368997355923,
AKAEMYTGDEICR,ub,K,11,true,"TAP 6xHis-tag Ub",1,19292762,XCorr,3.4000000,,,,,,
AKAEMYTGDEICR,ub,K,11,true,"Arabidopsis ubiquitination by TUBEs",2,23667124,,,,,,,,
AKAEMYTGDEICR,ub,K,11,true,"upl3 mutant / wildtype",168,35926874,"MaxQuant score",91.6200000,1.0000000,-0.6082323,0.4768400,NO,1.8287699276698E-5,-0.1971300
AEMYTGDEICR,nt,A,12,true,"Tic56 chloroplast import - tic56-1",89c,25588737,XCorr,2.9679716,,,,,,
AEMYTGDEICR,nt,A,12,true,"Arg/N-end rule seed, prt6 vs. Wt",99,29168982,"MASCOT Score",51.3000000,,-0.9242213,0.0067170,NO,0.03779000043869,-0.3955372
AEMYTGDEICR,nta,A,12,true,"FtsH12 N-terminome: WT / FtsH12 knockdown miRNA",118,33216923,"MaxQuant score",156.7500000,,,,,8.5400003041469E-12,
AEMYTGDEICR,ox,C,21,true,"SPEAR - 50 mM H2O2 / mock",138b,34619326,,,,1.7271831,0.0027292,YES,,
YTGDEICR,ox,C,21,false,"SPEAR - 50 mM H2O2 / mock",138b,34619326,,,,1.5548490,0.0425171,YES,,
AEMYTGDEICR,sno,C,21,true,"Site-specific nitrosomeproteomic id - gsnor1-3",90a,25699590,XCorr,3.8698704,,,,,1.7430000298191E-5,-5.9898394
AEMYTGDEICR,sno,C,21,true,"hot5-4 / wildtype, FAT-switch S-nitrosoproteome",169,37277371,,,,0.2002332,0.4334858,NO,,
YTGDEICR,sno,C,21,false,"hot5-4 / wildtype, FAT-switch S-nitrosoproteome",169,37277371,,,,,,,,
YTGDEICR,so,C,21,false,"Arabidopsis S-sulfenylation chemoproteomics",108,31578252,"pFind PSM Score",0.0292892,,1.5095300,,,,1.0956339
EISMPNGLLPLK,mox,M,34,true,"cat2 Methionine oxidation - 1h stress",62a,25693801,"MASCOT Score",57.0000000,,0.0713330,,NO,,
EISMPNGLLPLK,mox,M,34,true,"cat2 Methionine oxidation - 3h stress",62b,25693801,"MASCOT Score",42.0000000,,0.1838498,,NO,,
SITHKFTEIDK,ac,K,67,true,"Histone deacetylases substrates - TSA vs control",98b,29061669,"MaxQuant Score",78.3000000,1.0000000,0.0150000,0.9977001,NO,2.4999999368447E-5,
SITHKFTEIDK,ub,K,67,true,"upl3 mutant / wildtype",168,35926874,"MaxQuant score",102.9700000,1.0000000,-0.0724828,,,0.00050128402654082,-0.0941850
KLTGVKAK,ac,K,97,false,"Quantitative Acetylproteomics",101,29440448,,,,,,,,
LTGVKAK,ac,K,97,false,"Quantitative Acetylproteomics",101,29440448,,,,,,,,
ITFKTPTTLSR,ph,T,123,true,"atm and atr DNA damage response",88,25561503,"MASCOT Score",20.0000000,1.0000000,,,,,-0.2300000
ITFKTPTTLSR,ph,T,123,true,"Tissue atlas Arabidopsis - ProteomicsDB",114,32188942,"MaxQuant score",147.7300000,0.9994510,,,,1.4683699589568E-7,
ITFKTPTTLSR,ph,T,125,true,"Large-scale phosphorylation discovery",44,23111157,XCorr,2.4850000,,,,,,
TFPVTAFIVPEEPAKEEPAKEEPAK,ub,K,144,true,"upl3 mutant / wildtype",168,35926874,"MaxQuant score",89.4620000,0.9820000,0.5597365,0.4869800,NO,7.0067901480897E-10,-1.0308000
TFPVTAFIVPEEPAKEEPAKEEPAK,ub,K,149,true,"upl3 mutant / wildtype",168,35926874,"MaxQuant score",81.4800000,0.9710000,,,,2.4927700792432E-8,-0.0684290
EKSSEATEAK,ac,K,156,true,"Quantitative Acetylproteomics",101,29440448,,,,,,,,
EKSSEATEAK,ph,S,157,true,"atm and atr DNA damage response",88,25561503,"MASCOT Score",66.0000000,1.0000000,,,,,-1.9000000
SSEATEAKEAVAIK,ub,K,164,true,"upl3 mutant / wildtype",168,35926874,"MaxQuant score",139.3000000,1.0000000,0.3242346,0.7123600,NO,1.2133699600625E-9,-0.3205100
EAVAIKEAVAVKEAA,nt,E,165,true,"Metacaspase9 substrates - Col-0 / mc9",51a,23964026,"MASCOT Score",45.0000000,,,,,,-0.4651144
EAVAIKEAVAVKEAA,nt,E,165,true,"Metacaspase9 substrates - 35S:MC9 / mc9",51b,23964026,"MASCOT Score",45.0000000,,,,,,-1.9185942
EAVAIKEAVAVK,ub,K,170,true,"upl3 mutant / wildtype",168,35926874,"MaxQuant score",128.8500000,1.0000000,0.8040536,0.1804420,NO,1.9357798919373E-6,0.9045600
EAVAVKEAA,ub,K,176,true,"upl3 mutant / wildtype",168,35926874,"MaxQuant score",83.9980000,1.0000000,0.1978654,0.5925000,NO,0.0091827204450965,0.9134900
