Peptide,PTM,ModifiedAA,ModifiedPosition,PeptideUniqueToGene,ExperimentDesc,ExpID,PubmedID,ScoreType,IdentScore,LocProb,Log2FChange,PQ-val,QuantSig,PEP,MassErrorPPM
AVIFEERFDDGWEN,nt,A,23,true,"HUNTER N-terminome: legumain, GluC and trypsin",119,31951383,"MaxQuant score",191.2600000,,,,,,
AVIFEERFDD,nt,A,23,true,"HUNTER N-terminome: legumain, GluC and trypsin",119,31951383,"MaxQuant score",83.0050000,,,,,,
AVIFEER,nt,A,23,true,"Arg/N-end rule pathway Roots",80,25728785,"MASCOT Score",48.8100000,,,,,0.011479999870062,
AVIFEER,nt,A,23,true,"Arg/N-end rule seed, prt6 vs. Wt",99,29168982,"MASCOT Score",39.2500000,,-0.0438140,0.5740128,NO,0.15500000119209,-1.1865057
KDDNTAGEWK,cr,K,45,false,"Open search Plant PTM Viewer 2.0 - Crotonylation",164c,TBA,,,,,,,,
DDNTAGEWKHTAGNWSGDANDKGIQTSEDYR,ng,N,59,false,"N-Glycopeptide Profiling in Arabidopsis Infloresce",132,27067053,"MOWSE score",26.0000000,,,,,0.0017999999690801,
HTAGNWSGDANDKGIQTSEDYR,ng,N,59,false,"Conserved N-glycosylation",74,22633491,"MaxQuant Score",343.4900000,1.0000000,,,,0,-0.4120000
HTAGNWSGDANDKGIQTSEDYR,ng,N,59,false,"N-glycan occupancy Arabidopsis glycoproteins",87,23994444,"Ladder score",79.8000000,,,,,,
HTAGNWSGDANDKGIQTSEDYR,ng,N,59,false,"N-Glycopeptide Profiling in Arabidopsis Infloresce",132,27067053,"MOWSE score",32.2000000,,,,,2.7000000045518E-5,
HTAGNWSGDANDKGIQTSEDYR,ng,N,59,false,"ER-associatied N-glycan degradation chilling stres",133,27558752,,,,,,,,
HTAGNWSGDANDKGIQTSEDYR,ng,N,59,false,"UDP-GlcNAc transporter glycopeptide analysis",135,30224661,,,,,,,2.0906232595029E-19,0.6000000
DDNTAGEWKHTAGNWSGDANDK,ng,N,59,false,"N-Glycopeptide Profiling in Arabidopsis Infloresce",132,27067053,"MOWSE score",53.6000000,,,,,6.3999999611042E-7,
HTAGNWSGDANDK,ng,N,59,false,"N-glycan occupancy Arabidopsis glycoproteins",87,23994444,"Ladder score",54.7000000,,,,,,
HTAGNWSGDANDK,ng,N,59,false,"N-linked Glycan Micro-heterogeneity Arabidopsis",134,29237727,,,,,,,,
HTAGNWSGDANDK,ng,N,59,false,"UDP-GlcNAc transporter glycopeptide analysis",135,30224661,,,,,,,3.3579265941181E-14,0.8000000
LDCGGGYMK,ox,C,108,false,"OxiTRAQ Arabidopsis - 5 mM H2O2 versus control",47,24376095,,,,-0.3578046,0.0357132,NO,,
LDCGGGYMK,sno,C,108,false,"hot5-4 / wildtype, FAT-switch S-nitrosoproteome",169,37277371,,,,0.4721570,0.0276806,NO,,
LDCGGGYMK,so,C,108,false,"S-sulfenylation site detection using YAP1C",110,32714340,,,,,,,,
LLSGDVDQK,ph,S,117,true,"SIRK1 phosphorylation",86a,23820729,"MaxQuant Score",63.1630000,1.0000000,,,,0.81300002336502,9.1230000
KFGGDTPYSIMFGPDICGYSTK,ox,C,140,false,"OxiTRAQ SA and flg22 responses - SA vs mock",91a,25720653,"MASCOT Score",42.4900000,,0.6507646,0.0050000,YES,,
KFGGDTPYSIMFGPDICGYSTK,ox,C,140,false,"OxiTRAQ SA and flg22 responses - flg22 vs mock",91b,25720653,"MASCOT Score",42.4900000,,0.4436067,0.3840000,NO,,
FGGDTPYSIMFGPDICGYSTK,so,C,140,false,"S-sulfenylation site detection using YAP1C",110,32714340,,,,,,,,
ATYSILIDNVE,nt,A,183,false,"Arg/N-end rule seed, prt6 vs. Wt",99,29168982,"MASCOT Score",40.5800000,,-1.6939740,0.0670058,NO,0.0011180000146851,-1.3590977
SILIDNVEKQTGSLY,nt,S,186,false,"Arabidopsis translation initiation landscape - NT",167b,35069635,,,,,,,,
NEEEESKDAPAESDAEDEPEDDEGGDDSDSESKAEETK,ph,S,381,true,"PAMP-triggered phosphorylation",48,24601666,"MASCOT Score",26.7100000,,,,,,
NEEEESKDAPAESDAEDEPEDDEGGDDSDSESKAEETK,ph,S,381,true,"LAXIC - mannitol vs control",84b,23660473,XCorr,6.5000000,0.9250000,-1.1705096,,NO,3.2599999144622E-8,
NEEEESKDAPAESDAEDEPEDDEGGDDSDSESKAEETK,ph,S,381,true,"SnRK2 protein kinase substrates",85,23776212,XCorr,4.7055078,0.9160000,,,,3.96250006599E-16,
KNEEEESKDAPAESDAEDEPEDDEGGDDSDSESK,ph,S,381,true,"LAXIC - mannitol vs control",84b,23660473,XCorr,6.6300000,0.9610000,-1.7985038,,NO,4.3799999587137E-16,
KNEEEESKDAPAESDAEDEPEDDEGGDDSDSESK,ph,S,381,true,"SnRK2 protein kinase substrates",85,23776212,XCorr,4.7308435,0.9690000,,,,1.5514199896548E-13,
KNEEEESKDAPAESDAEDEPEDDEGGDDSDSESK,ph,S,381,true,"Brassinosteroid-Regulated Phosphorylation Dynamics",94,26187819,"MaxQuant Score",132.7600000,0.9980000,,,,1.2520000248919E-19,0.8530000
NEEEESKDAPAESDAEDEPEDDEGGDDSDSESK,ph,S,381,true,"LAXIC - mannitol vs control",84b,23660473,XCorr,6.9000000,1.0000000,,,,2.9899999276495E-7,
NEEEESKDAPAESDAEDEPEDDEGGDDSDSESK,ph,S,381,true,"SnRK2 protein kinase substrates",85,23776212,XCorr,5.8694572,1.0000000,,,,4.5096501708031E-5,
DAPAESDAEDEPEDDEGGDDSDSESKAEETK,ph,S,381,true,"ABA-induced protein phosphorylation",35,20733066,,,,,,,,
DAPAESDAEDEPEDDEGGDDSDSESKAEETK,ph,S,381,true,"STN8 phosphoproteome",38,21768351,"MASCOT Score",174.2200000,,,,,,-1.5689600
DAPAESDAEDEPEDDEGGDDSDSESKAEETK,ph,S,381,true,"srk2dei ABA signaling phopshoproteomics",83,23572148,"MASCOT Score",122.0000000,,,,,,-0.0044000
DAPAESDAEDEPEDDEGGDDSDSESKAEETK,ph,S,381,true,"LAXIC - mannitol vs control",84b,23660473,XCorr,7.9800000,0.9590000,-1.3740983,,NO,4.1400000552519E-16,
DAPAESDAEDEPEDDEGGDDSDSESKAEETK,ph,S,381,true,"SnRK2 protein kinase substrates",85,23776212,XCorr,5.1703048,1.0000000,,,,4.013430039526E-16,
DAPAESDAEDEPEDDEGGDDSDSESKAEETK,ph,S,381,true,"Brassinosteroid-Regulated Phosphorylation Dynamics",94,26187819,"MaxQuant Score",132.7600000,1.0000000,,,,1.2520000248919E-19,0.2930000
DAPAESDAEDEPEDDEGGDDSDSESKAEETK,ph,S,381,true,"Col-0 callus - FC Col-0 vs. Col-0 Xray",111a,31410901,,56.0500000,,1.6135819,0.0000000,NO,,1.1320565
DAPAESDAEDEPEDDEGGDDSDSESKAEETK,ph,S,381,true,"Col-0 X-ray callus - FC Col-0 vs. Col-0 Xray",111b,31410901,,56.0500000,,1.6135819,0.0000000,NO,,1.1320565
DAPAESDAEDEPEDDEGGDDSDSESKAEETK,ph,S,381,true,"atm callus - FC atm vs. atm Xray",111c,31410901,,56.0500000,,-18.3395738,0.0000000,NO,,1.1320565
DAPAESDAEDEPEDDEGGDDSDSESKAEETK,ph,S,381,true,"atm-3 X-ray callus - FC atm vs. atm Xray",111d,31410901,,56.0500000,,-18.3395738,0.0000000,NO,,1.1320565
DAPAESDAEDEPEDDEGGDDSDSESK,ph,S,381,true,"STN8 phosphoproteome",38,21768351,"MASCOT Score",95.9100000,,,,,,-1.4242300
DAPAESDAEDEPEDDEGGDDSDSESK,ph,S,381,true,"Pollen phosphoproteome Arabidopsis",43,22631563,"MASCOT Score",73.9400000,,,,,,-1.9083400
DAPAESDAEDEPEDDEGGDDSDSESK,ph,S,381,true,"Chloroplast kinase substrates",60,19376835,"MASCOT Score",31.3700000,,,,,,-1.0705200
DAPAESDAEDEPEDDEGGDDSDSESK,ph,S,381,true,"srk2dei ABA signaling phopshoproteomics",83,23572148,"MASCOT Score",98.0000000,,,,,,-0.0058000
DAPAESDAEDEPEDDEGGDDSDSESK,ph,S,381,true,"LAXIC - mannitol vs control",84b,23660473,XCorr,4.9500000,1.0000000,,,,0.0015974299749359,
DAPAESDAEDEPEDDEGGDDSDSESK,ph,S,381,true,"Brassinosteroid-Regulated Phosphorylation Dynamics",94,26187819,"MaxQuant Score",132.7600000,1.0000000,,,,3.2149999486643E-15,1.2340000
DAPAESDAEDEPEDDEGGDDSDSESK,ph,S,381,true,"TOR Kinase and ABA Receptor",100,29290610,XCorr,7.0703530,1.0000000,,,,2.172000079792E-11,
DAPAESDAEDEPEDDEGGDDSDSESK,ph,S,381,true,"Lateral root-induction - NAA vs control",106,23328941,"MASCOT Score",57.0000000,,,,,,
KNEEEESKDAPAESDAEDEPEDDEGGDDSDSESK,ph,S,396,true,"LAXIC - mannitol vs control",84b,23660473,XCorr,6.6300000,0.9270000,,,,4.3799999587137E-16,
KNEEEESKDAPAESDAEDEPEDDEGGDDSDSESK,ph,S,396,true,"Brassinosteroid-Regulated Phosphorylation Dynamics",94,26187819,"MaxQuant Score",132.7600000,0.9910000,,,,1.2520000248919E-19,0.8530000
DAPAESDAEDEPEDDEGGDDSDSESKAEETK,ph,S,396,true,"srk2dei ABA signaling phopshoproteomics",83,23572148,"MASCOT Score",108.0000000,,,,,,-0.0012000
DAPAESDAEDEPEDDEGGDDSDSESKAEETK,ph,S,396,true,"Brassinosteroid-Regulated Phosphorylation Dynamics",94,26187819,"MaxQuant Score",132.7600000,0.9480000,,,,1.2520000248919E-19,0.2930000
DAPAESDAEDEPEDDEGGDDSDSESK,ph,S,396,true,"srk2dei ABA signaling phopshoproteomics",83,23572148,"MASCOT Score",63.0000000,,,,,,-0.0062000
DAPAESDAEDEPEDDEGGDDSDSESK,ph,S,396,true,"TOR Kinase and ABA Receptor",100,29290610,XCorr,7.0703530,0.9888000,,,,2.172000079792E-11,
DAPAESDAEDEPEDDEGGDDSDSESK,ph,S,396,true,"Lateral root-induction - NAA vs control",106,23328941,"MASCOT Score",27.0000000,,-0.1088191,0.5505829,NO,,
DAPAESDAEDEPEDDEGGDDSDSESKAEETK,ph,S,398,true,"Col-0 callus - FC Col-0 vs. Col-0 Xray",111a,31410901,,56.0500000,,1.6135819,0.0000000,NO,,1.1320565
DAPAESDAEDEPEDDEGGDDSDSESKAEETK,ph,S,398,true,"Col-0 X-ray callus - FC Col-0 vs. Col-0 Xray",111b,31410901,,56.0500000,,1.6135819,0.0000000,NO,,1.1320565
DAPAESDAEDEPEDDEGGDDSDSESKAEETK,ph,S,398,true,"atm callus - FC atm vs. atm Xray",111c,31410901,,56.0500000,,-18.3395738,0.0000000,NO,,1.1320565
DAPAESDAEDEPEDDEGGDDSDSESKAEETK,ph,S,398,true,"atm-3 X-ray callus - FC atm vs. atm Xray",111d,31410901,,56.0500000,,-18.3395738,0.0000000,NO,,1.1320565
AEETKSVDSEETSEK,ph,T,405,true,"Tissue atlas Arabidopsis - ProteomicsDB",114,32188942,"MaxQuant score",84.8950000,0.9980530,,,,0.00089349900372326,
SVDSEETSEKDATAHDEL,ph,S,407,true,"SnRK2 protein kinase substrates",85,23776212,XCorr,3.5721905,0.9800000,,,,2.9259700440321E-8,
SVDSEETSEKDATAHDEL,ph,S,407,true,"Tissue atlas Arabidopsis - ProteomicsDB",114,32188942,"MaxQuant score",229.4100000,1.0000000,,,,0,
SVDSEETSEKDATAHDEL,ph,S,410,true,"Tissue atlas Arabidopsis - ProteomicsDB",114,32188942,"MaxQuant score",324.2900000,0.9999980,,,,0,
SVDSEETSEKDATAHDEL,ph,S,414,true,"Tissue atlas Arabidopsis - ProteomicsDB",114,32188942,"MaxQuant score",198.0900000,0.9815970,,,,2.8025969286496E-45,
