Peptide,PTM,ModifiedAA,ModifiedPosition,PeptideUniqueToGene,ExperimentDesc,ExpID,PubmedID,ScoreType,IdentScore,LocProb,Log2FChange,PQ-val,QuantSig,PEP,MassErrorPPM
KSTGGKAPR,ac,K,10,false,"Lysine acetylation gel-based Finkemeier et al",37,21311031,i-probability,0.9996190,,,,,,
KSTGGKAPR,ac,K,10,false,"Histone deacetylases - apicidin vs control",98a,29061669,"MaxQuant Score",125.7000000,1.0000000,1.5420000,0.0024155,YES,0.00030000001424924,
KSTGGKAPR,ac,K,10,false,"Histone deacetylases- hda14 vs WT (low light)",98c,29061669,"MaxQuant Score",117.0200000,1.0000000,-0.0860000,0.9885531,NO,0.0010000000474975,
KSTGGKAPR,ac,K,10,false,"Histone deacetylases substrates - hda14 vs WT",98e,29061669,"MaxQuant Score",102.5000000,1.0000000,-0.0680000,0.9120108,NO,4.600000102073E-5,
KSTGGKAPR,ac,K,10,false,"Quantitative Acetylproteomics",101,29440448,,,,,,,,
KSTGGKAPR,ub,K,10,false,"Arabidopsis ubiquitination COFRADIC",40,26744219,"MaxQuant Score",78.1360000,0.9890000,,,,0.003000000026077,-0.0600000
STGGKAPRKQLATKAAR,ac,K,15,false,"Quantitative Acetylproteomics",101,29440448,,,,,,,,
KSTGGKAPR,ac,K,15,false,"Lysine acetylation gel-based Finkemeier et al",37,21311031,i-probability,0.9996190,,,,,,
KSTGGKAPR,ac,K,15,false,"Histone deacetylases - apicidin vs control",98a,29061669,"MaxQuant Score",125.7000000,1.0000000,1.5420000,0.0024155,YES,0.00030000001424924,
KSTGGKAPR,ac,K,15,false,"Histone deacetylases- hda14 vs WT (low light)",98c,29061669,"MaxQuant Score",117.0200000,1.0000000,-0.0860000,0.9885531,NO,0.0010000000474975,
KSTGGKAPR,ac,K,15,false,"Histone deacetylases substrates - hda14 vs WT",98e,29061669,"MaxQuant Score",102.5000000,1.0000000,-0.0680000,0.9120108,NO,4.600000102073E-5,
KSTGGKAPR,ac,K,15,false,"Quantitative Acetylproteomics",101,29440448,,,,,,,,
STGGKAPR,ac,K,15,false,"Histone deacetylases- hda14 vs WT (low light)",98c,29061669,"MaxQuant Score",146.0300000,1.0000000,-0.0860000,0.9885531,NO,0.0010000000474975,
STGGKAPR,ac,K,15,false,"Quantitative Acetylproteomics",101,29440448,,,,,,,,
KSTGGKAPR,ub,K,15,false,"Arabidopsis ubiquitination COFRADIC",40,26744219,"MaxQuant Score",96.6650000,0.9180000,,,,0.0020000000949949,-0.3400000
STGGKAPRKQLATKAAR,ac,K,19,false,"Quantitative Acetylproteomics",101,29440448,,,,,,,,
APRKQLATKAAR,ac,K,19,false,"Quantitative Acetylproteomics",101,29440448,,,,,,,,
KQLATKAAR,ac,K,19,false,"Histone deacetylases - apicidin vs control",98a,29061669,"MaxQuant Score",177.8000000,1.0000000,2.6440000,0.0007889,YES,0,
KQLATKAAR,ac,K,19,false,"Histone deacetylases substrates - TSA vs control",98b,29061669,"MaxQuant Score",177.8000000,1.0000000,2.8290000,0.0064714,YES,0,
KQLATKAAR,ac,K,19,false,"Histone deacetylases- hda14 vs WT (low light)",98c,29061669,"MaxQuant Score",202.9600000,1.0000000,0.7290000,0.9885531,NO,8.9999998564849E-9,
KQLATKAAR,ac,K,19,false,"Histone deacetylases - hda14 vs WT (thylakoids)",98d,29061669,"MaxQuant Score",117.5000000,1.0000000,-0.0480000,0.9954054,NO,9.5199997304007E-5,
KQLATKAAR,ac,K,19,false,"Histone deacetylases substrates - hda14 vs WT",98e,29061669,"MaxQuant Score",203.0000000,1.0000000,-0.0240000,0.9705100,NO,0,
KQLATKAAR,ac,K,19,false,"Quantitative Acetylproteomics",101,29440448,,,,,,,,
KQLATKAAR,ub,K,19,false,"Arabidopsis ubiquitination COFRADIC",40,26744219,"MaxQuant Score",65.7190000,1.0000000,,,,0.0060000000521541,-0.3790000
STGGKAPRKQLATKAAR,ac,K,24,false,"Quantitative Acetylproteomics",101,29440448,,,,,,,,
APRKQLATKAAR,ac,K,24,false,"Quantitative Acetylproteomics",101,29440448,,,,,,,,
KQLATKAAR,ac,K,24,false,"Histone deacetylases - apicidin vs control",98a,29061669,"MaxQuant Score",177.8000000,1.0000000,2.6440000,0.0007889,YES,0,
KQLATKAAR,ac,K,24,false,"Histone deacetylases substrates - TSA vs control",98b,29061669,"MaxQuant Score",177.8000000,1.0000000,2.8290000,0.0064714,YES,0,
KQLATKAAR,ac,K,24,false,"Histone deacetylases- hda14 vs WT (low light)",98c,29061669,"MaxQuant Score",202.9600000,1.0000000,0.7290000,0.9885531,NO,8.9999998564849E-9,
KQLATKAAR,ac,K,24,false,"Histone deacetylases - hda14 vs WT (thylakoids)",98d,29061669,"MaxQuant Score",117.5000000,1.0000000,-0.0480000,0.9954054,NO,9.5199997304007E-5,
KQLATKAAR,ac,K,24,false,"Histone deacetylases substrates - hda14 vs WT",98e,29061669,"MaxQuant Score",203.0000000,1.0000000,-0.0240000,0.9705100,NO,0,
KQLATKAAR,ac,K,24,false,"Quantitative Acetylproteomics",101,29440448,,,,,,,,
QLATKAAR,ac,K,24,false,"Histone deacetylases - apicidin vs control",98a,29061669,"MaxQuant Score",177.8000000,1.0000000,2.6440000,0.0007889,YES,0,
QLATKAAR,ac,K,24,false,"Histone deacetylases substrates - TSA vs control",98b,29061669,"MaxQuant Score",177.8000000,1.0000000,2.8290000,0.0064714,YES,0,
QLATKAAR,ac,K,24,false,"Histone deacetylases- hda14 vs WT (low light)",98c,29061669,"MaxQuant Score",202.9600000,1.0000000,0.7290000,0.9885531,NO,8.9999998564849E-9,
QLATKAAR,ac,K,24,false,"Histone deacetylases - hda14 vs WT (thylakoids)",98d,29061669,"MaxQuant Score",117.5000000,1.0000000,-0.0480000,0.9954054,NO,9.5199997304007E-5,
QLATKAAR,ac,K,24,false,"Histone deacetylases substrates - hda14 vs WT",98e,29061669,"MaxQuant Score",203.0000000,1.0000000,-0.0240000,0.9705100,NO,0,
QLATKAAR,ac,K,24,false,"Quantitative Acetylproteomics",101,29440448,,,,,,,,
KQLATKAAR,hib,K,24,false,"Histone Khib and acetylation, dark-induced starvat",137,34165567,,,0.9995750,,,,,
KQLATKAAR,ub,K,24,false,"Arabidopsis ubiquitination COFRADIC",40,26744219,"MaxQuant Score",109.6600000,1.0000000,,,,0.00093249999918044,0.1050000
KQLATKAAR,ub,K,24,false,"Ubiquitination Membrane Proteins",120,33585938,,,,,,,,
KSAPATGGVKKPHR,ac,K,28,false,"Histone deacetylases - apicidin vs control",98a,29061669,"MaxQuant Score",103.8000000,1.0000000,3.7030000,0.0198609,YES,6.1999999324932E-18,
KSAPATGGVK,ac,K,28,false,"Lysine acetylation gel-based Arabidopsis",36,21311030,"MASCOT Score",55.0000000,,,,,,-0.1666000
KSAPATGGVKKPHR,me1,K,28,false,"Arabidopsis protein methylome",123,31809900,"MaxQuant Score",112.9400000,1.0000000,,,,8.8778000417733E-7,-1.7248000
KSAPATGGVKKPHR,me2,K,28,false,"Arabidopsis protein methylome",123,31809900,"MaxQuant Score",147.2600000,1.0000000,,,,0,0.8986300
KSAPATGGVKKPHR,ac,K,37,false,"Histone deacetylases - apicidin vs control",98a,29061669,"MaxQuant Score",103.8000000,1.0000000,3.7030000,0.0198609,YES,6.1999999324932E-18,
KSAPATGGVKKPHR,me1,K,37,false,"Arabidopsis protein methylome",123,31809900,"MaxQuant Score",112.9400000,1.0000000,,,,8.8778000417733E-7,-1.7248000
KSAPATGGVKKPHR,me2,K,37,false,"Arabidopsis protein methylome",123,31809900,"MaxQuant Score",147.2600000,0.9720000,,,,0,0.8986300
SAPATGGVKK,me2,K,37,false,"Arabidopsis protein methylome",123,31809900,"MaxQuant Score",152.0700000,1.0000000,,,,0,-0.5778500
KSAPATGGVKKPHR,ac,K,38,false,"Histone deacetylases - apicidin vs control",98a,29061669,"MaxQuant Score",103.8000000,1.0000000,3.7030000,0.0198609,YES,6.1999999324932E-18,
KSAPATGGVKKPHR,me1,K,38,false,"Arabidopsis protein methylome",123,31809900,"MaxQuant Score",112.9400000,1.0000000,,,,8.8778000417733E-7,-1.7248000
KYQKSTELLIR,hib,K,54,false,"Histone Khib and acetylation, dark-induced starvat",137,34165567,,,0.8865540,,,,,
KYQKSTELLIR,ub,K,54,false,"Arabidopsis ubiquitination COFRADIC",40,26744219,"MaxQuant Score",90.6140000,1.0000000,,,,0.00020450000010896,0.1150000
KYQKSTELLIR,ub,K,54,false,"Ubiquitination Membrane Proteins",120,33585938,,,,,,,,
YQKSTELLIR,hib,K,57,false,"Histone Khib and acetylation, dark-induced starvat",137,34165567,,,1.0000000,,,,,
KYQKSTELLIR,ub,K,57,false,"Arabidopsis ubiquitination COFRADIC",40,26744219,"MaxQuant Score",138.4500000,1.0000000,,,,8.3480002424641E-12,-0.0060000
KYQKSTELLIR,ub,K,57,false,"Ubiquitination Membrane Proteins",120,33585938,,,,,,,,
YQKSTELLIR,ub,K,57,false,"upl3 mutant / wildtype",168,35926874,"MaxQuant score",96.3420000,1.0000000,0.8559897,0.1123810,NO,0.00037671599420719,0.2585600
EIAQDFKTDLR,ac,K,80,false,"Histone deacetylases - apicidin vs control",98a,29061669,"MaxQuant Score",82.1000000,1.0000000,-0.1910000,0.2766942,NO,0.0020000000949949,
EIAQDFKTDLR,ac,K,80,false,"Histone deacetylases substrates - TSA vs control",98b,29061669,"MaxQuant Score",82.1000000,1.0000000,-0.3740000,0.9462372,NO,0.0020000000949949,
EIAQDFKTDLR,ac,K,80,false,"Histone deacetylases- hda14 vs WT (low light)",98c,29061669,"MaxQuant Score",86.9400000,1.0000000,-0.1450000,0.9885531,NO,0.016000000759959,
EIAQDFKTDLR,ac,K,80,false,"Histone deacetylases - hda14 vs WT (thylakoids)",98d,29061669,"MaxQuant Score",79.5000000,1.0000000,0.4710000,0.8452788,NO,0.003000000026077,
EIAQDFKTDLR,ac,K,80,false,"Histone deacetylases substrates - hda14 vs WT",98e,29061669,"MaxQuant Score",65.2000000,1.0000000,0.0180000,0.9727472,NO,0.0010000000474975,
EIAQDFKTDLR,ac,K,80,false,"Quantitative Acetylproteomics",101,29440448,,,,,,,,
EIAQDFKTDLR,hib,K,80,false,"Histone Khib and acetylation, dark-induced starvat",137,34165567,,,1.0000000,,,,,
EIAQDFKTDLR,me1,K,80,false,"Arabidopsis protein methylome",123,31809900,"MaxQuant Score",106.2900000,1.0000000,,,,2.6380799681647E-5,-0.5343900
EIAQDFKTDLR,me2,K,80,false,"Arabidopsis protein methylome",123,31809900,"MaxQuant Score",204.4800000,1.0000000,,,,0,0.5250700
EIAQDFKTDLR,ub,K,80,false,"Arabidopsis ubiquitination COFRADIC",40,26744219,"MaxQuant Score",97.4390000,1.0000000,,,,3.9149999793153E-6,0.0500000
EIAQDFKTDLR,ub,K,80,false,"Ubiquitination Membrane Proteins",120,33585938,,,,,,,,
EIAQDFKTDLR,ub,K,80,false,"upl3 mutant / wildtype",168,35926874,"MaxQuant score",108.9000000,1.0000000,-0.2653446,,,0.00028158098575659,1.0254000
VTIMPKDIQLAR,hib,K,123,false,"Histone Khib and acetylation, dark-induced starvat",137,34165567,,,1.0000000,,,,,
VTIMPKDIQLAR,ub,K,123,false,"Arabidopsis ubiquitination COFRADIC",40,26744219,"MaxQuant Score",111.9400000,1.0000000,,,,2.581999891671E-10,-0.1880000
