Peptide,PTM,ModifiedAA,ModifiedPosition,PeptideUniqueToGene,ExperimentDesc,ExpID,PubmedID,ScoreType,IdentScore,LocProb,Log2FChange,PQ-val,QuantSig,PEP,MassErrorPPM
YILNSKPTTFGIAK,ph,S,192,true,"Tissue atlas Arabidopsis - ProteomicsDB",114,32188942,"MaxQuant score",82.8650000,0.9783840,,,,9.5893003162928E-5,
LGSGDLGR,ph,S,300,true,"Pollen phosphoproteome Arabidopsis",43,22631563,"MASCOT Score",54.3900000,,,,,,-1.5541400
LGSGDLGR,ph,S,300,true,"Tissue atlas Arabidopsis - ProteomicsDB",114,32188942,"MaxQuant score",119.2500000,1.0000000,,,,0.00029274600092322,
ESGADQTQLQRPLTPDK,ph,T,769,true,"Tissue atlas Arabidopsis - ProteomicsDB",114,32188942,"MaxQuant score",198.8400000,1.0000000,,,,5.7941589552135E-40,
SLGVSSSFSK,ph,S,778,true,"Tissue atlas Arabidopsis - ProteomicsDB",114,32188942,"MaxQuant score",81.0020000,0.9998370,,,,0.0014930500183254,
SLGVSSSFSK,ph,S,784,true,"Tissue atlas Arabidopsis - ProteomicsDB",114,32188942,"MaxQuant score",155.2400000,0.9807440,,,,9.1203997953926E-7,
SMIPSLIPTPTR,ph,T,975,true,"Tissue atlas Arabidopsis - ProteomicsDB",114,32188942,"MaxQuant score",128.9500000,0.8053790,,,,3.2759999157861E-5,
TLSLGAAISSPGQTSSR,ph,S,981,true,"Tissue atlas Arabidopsis - ProteomicsDB",114,32188942,"MaxQuant score",219.9600000,0.9984110,,,,0,
TLSLGAAISSPGQTSSR,ph,S,988,true,"Tissue atlas Arabidopsis - ProteomicsDB",114,32188942,"MaxQuant score",219.9600000,0.9972560,,,,0,
