Peptide,PTM,ModifiedAA,ModifiedPosition,PeptideUniqueToGene,ExperimentDesc,ExpID,PubmedID,ScoreType,IdentScore,LocProb,Log2FChange,PQ-val,QuantSig,PEP,MassErrorPPM
AEIGKTVLDFGWIAAR,nt,A,2,true,"N-terminal ChaFRADIC",92,26010716,"MASCOT Score",41.4300000,,,,,1.0509999810893E-5,
AEIGKTVLDFGWIAAR,nt,A,2,true,"Stromal N-terminome",96,26371235,"MASCOT Score",97.1300000,,,,,,
AEIGKTVLD,nt,A,2,true,"N-terminal ChaFRADIC",92,26010716,"MASCOT Score",29.8700000,,,,,0.11490000039339,
AEIGKTVLDFGWIAAR,nta,A,2,true,"N-terminal ChaFRADIC",92,26010716,"MASCOT Score",41.4300000,,,,,1.0509999810893E-5,
AEIGKTVLDFGWIAAR,nta,A,2,true,"Stromal N-terminome",96,26371235,"MASCOT Score",97.1300000,,,,,,
AEIGKTVLDFGWIAAR,nta,A,2,true,"HUNTER N-terminome: legumain, GluC and trypsin",119,31951383,"MaxQuant score",83.5400000,,,,,,
AEIGKTVLD,nta,A,2,true,"N-terminal ChaFRADIC",92,26010716,"MASCOT Score",29.8700000,,,,,0.11490000039339,
SNLLALIVHPPDHPGTIPPEGGQGGDHE,nt,S,144,true,"N-terminal ChaFRADIC",92,26010716,"MASCOT Score",29.4300000,,,,,5.0870001544467E-9,
EHLQTENVLIPAQGR,nt,E,263,true,"N-terminal ChaFRADIC",92,26010716,"MASCOT Score",57.5200000,,,,,4.5000000947759E-10,
HLQTENVLIPAQGR,nt,H,264,true,"N-terminal ChaFRADIC",92,26010716,"MASCOT Score",33.0200000,,,,,4.1279999862809E-8,
TENVLIPAQGR,nt,T,267,true,"Tic56 chloroplast import - tic56-1",89c,25588737,XCorr,2.8627713,,,,,,
TENVLIPAQGR,nt,T,267,true,"Arg/N-end rule seed, prt6 vs. Wt",99,29168982,"MASCOT Score",49.4000000,,-0.9371539,0.0068481,NO,0.016140000894666,-0.5171279
TENVLIPAQGR,nt,T,267,true,"FtsH12 N-terminome: WT / FtsH12 knockdown miRNA",118,33216923,"MaxQuant score",59.5130000,,,,,0.0031034001149237,
TENVLIPAQGR,nt,T,267,true,"HUNTER N-terminome: legumain, GluC and trypsin",119,31951383,"MaxQuant score",111.6500000,,,,,,
TENVLIPAQ,nt,T,267,true,"N-terminal ChaFRADIC",92,26010716,"MASCOT Score",72.0400000,,,,,1.139999994848E-6,
VLIPAQGR,nt,V,270,true,"N-terminal ChaFRADIC",92,26010716,"MASCOT Score",50.3200000,,,,,0.0014090000186116,
DKDSDPSVYLDGTR,nt,D,492,true,"N-terminal ChaFRADIC",92,26010716,"MASCOT Score",20.1100000,,,,,2.7160000172444E-5,
DKDSDPSVYLDGTR,nt,D,492,true,"Stromal N-terminome",96,26371235,"MASCOT Score",33.8400000,,,,,,
DKDSDPSVYLDGTR,nt,D,492,true,"HUNTER N-terminome: legumain, GluC and trypsin",119,31951383,"MaxQuant score",97.8360000,,,,,,
DKDSDPSVYLD,nt,D,492,true,"HUNTER N-terminome: legumain, GluC and trypsin",119,31951383,"MaxQuant score",90.6290000,,,,,,
DKDSDPSVYLDGTR,nta,D,492,true,"FtsH12 N-terminome: WT / FtsH12 knockdown miRNA",118,33216923,"MaxQuant score",166.7800000,,,,,1.5899999198155E-5,
DSDPSVYLDGTR,nt,D,494,true,"N-terminal ChaFRADIC",92,26010716,"MASCOT Score",41.0300000,,,,,3.7550000797637E-6,
DSDPSVYLDGTR,nt,D,494,true,"Arg/N-end rule seed, prt6 vs. Wt",99,29168982,"MASCOT Score",30.7100000,,-0.8731612,0.0024840,NO,0.06751000136137,-1.7022434
DSDPSVYLDGTR,nt,D,494,true,"HUNTER N-terminome: legumain, GluC and trypsin",119,31951383,"MaxQuant score",81.8650000,,,,,,
DTYYKYGFNPEVGSVGMPVAETIR,ub,K,543,true,"upl3 mutant / wildtype",168,35926874,"MaxQuant score",52.3660000,1.0000000,-0.1031469,,,0.00010319599823561,0.3533500
GSDSGVAFFLR,nt,G,868,true,"Tic56 chloroplast import - wild-type",89a,25588737,XCorr,3.1784770,,,,,,
GSDSGVAFFLR,nt,G,868,true,"Tic56 chloroplast import - tic56-1",89c,25588737,XCorr,3.2155180,,,,,,
GSDSGVAFFLR,nt,G,868,true,"N-terminal ChaFRADIC",92,26010716,"MASCOT Score",55.3700000,,,,,2.3399999804496E-7,
GSDSGVAFFLR,nt,G,868,true,"Stromal N-terminome",96,26371235,"MASCOT Score",72.4000000,,,,,,
GSDSGVAFFLR,nt,G,868,true,"FtsH12 N-terminome: WT / FtsH12 knockdown miRNA",118,33216923,"MaxQuant score",91.9370000,,,,,0.012469000183046,
GSDSGVAFFLR,nt,G,868,true,"HUNTER N-terminome: legumain, GluC and trypsin",119,31951383,"MaxQuant score",64.7110000,,,,,,
GSDSGVAF,nt,G,868,true,"N-terminal ChaFRADIC",92,26010716,"MASCOT Score",43.6800000,,,,,0.024769999086857,
SDSGVAFFLR,nt,S,869,true,"N-terminal ChaFRADIC",92,26010716,"MASCOT Score",55.4400000,,,,,1.2739999874611E-5,
