Peptide,PTM,ModifiedAA,ModifiedPosition,PeptideUniqueToGene,ExperimentDesc,ExpID,PubmedID,ScoreType,IdentScore,LocProb,Log2FChange,PQ-val,QuantSig,PEP,MassErrorPPM
ATNNDFGAFIEK,nta,A,2,true,"Characterization plant N-terminal acetylation",6,22223895,"MASCOT Score",84.8200000,,,,,,
NDFGAFIE,nt,N,5,true,"N-terminal ChaFRADIC",92,26010716,"MASCOT Score",51.6000000,,,,,0.016319999471307,
VTISPTSTSSSPPSLQGLTFAIK,ph,S,24,true,"TOR Kinase and ABA Receptor",100,29290610,XCorr,4.8568091,0.7846000,,,,1.3659999353877E-7,
DTATLKR,ac,K,183,true,"Quantitative Acetylproteomics",101,29440448,,,,,,,,
LCSVPHDLLVQPLVGSVEK,sno,C,213,true,"Site-specific nitrosomeproteomic id - gsnor1-3",90a,25699590,XCorr,3.1420851,,,,,4.8260000767186E-5,-3.5783450
LCSVPHDLLVQPLVGSVEK,sno,C,213,true,"Site-specific nitrosomeproteomic id - gsnor1-3",90b,25699590,XCorr,5.6500000,,,,,0.0049859997816384,-4.0200000
LCSVPHDLLVQPLVGSVEK,so,C,213,true,"Arabidopsis S-sulfenylation chemoproteomics",108,31578252,"pFind PSM Score",0.0048930,,1.4705900,,,,-0.7257554
SFGGNTVVKK,ac,K,239,true,"Quantitative Acetylproteomics",101,29440448,,,,,,,,
