Peptide,PTM,ModifiedAA,ModifiedPosition,PeptideUniqueToGene,ExperimentDesc,ExpID,PubmedID,ScoreType,IdentScore,LocProb,Log2FChange,PQ-val,QuantSig,PEP,MassErrorPPM
ISGAAIRTYLLER,ph,T,244,false,"Brassinosteroid-Regulated Phosphorylation Dynamics",94,26187819,"MaxQuant Score",87.5660000,1.0000000,,,,0.013000000268221,-3.1960000
GSESGHLAVDAR,ph,S,1081,true,"Tissue atlas Arabidopsis - ProteomicsDB",114,32188942,"MaxQuant score",159.6500000,1.0000000,,,,6.7456201735538E-10,
GSESGHLAVDAR,ph,S,1083,true,"Tissue atlas Arabidopsis - ProteomicsDB",114,32188942,"MaxQuant score",236.5700000,1.0000000,,,,0,
SNLDLHSHSINHR,ph,S,1092,true,"Tissue atlas Arabidopsis - ProteomicsDB",114,32188942,"MaxQuant score",118.4700000,1.0000000,,,,1.7408599887858E-5,
SNLDLHSHSINHR,ph,S,1098,true,"Tissue atlas Arabidopsis - ProteomicsDB",114,32188942,"MaxQuant score",161.2400000,0.8007620,,,,3.6187799193457E-16,
SNLDLHSHSINHR,ph,S,1100,true,"Tissue atlas Arabidopsis - ProteomicsDB",114,32188942,"MaxQuant score",176.2800000,0.9719800,,,,0,
DPSEVEDKPQK,ph,S,1107,true,"Tissue atlas Arabidopsis - ProteomicsDB",114,32188942,"MaxQuant score",188.2600000,1.0000000,,,,2.5220598638877E-35,
RSSSATLFGR,ph,S,1220,false,"Tissue atlas Arabidopsis - ProteomicsDB",114,32188942,"MaxQuant score",154.7000000,0.9976910,,,,6.9026998517074E-7,
RSSSATLFGR,ph,S,1221,false,"Tissue atlas Arabidopsis - ProteomicsDB",114,32188942,"MaxQuant score",158.1100000,0.9968920,,,,5.636100013362E-7,
SSSATLFGR,ph,S,1222,false,"Tissue atlas Arabidopsis - ProteomicsDB",114,32188942,"MaxQuant score",162.8000000,0.9999930,,,,4.6863701186339E-7,
SVGNTAAQQALIAHWQGIVK,ph,S,1316,false,"Tissue atlas Arabidopsis - ProteomicsDB",114,32188942,"MaxQuant score",276.4000000,0.9976760,,,,0,
