Peptide,PTM,ModifiedAA,ModifiedPosition,PeptideUniqueToGene,ExperimentDesc,ExpID,PubmedID,ScoreType,IdentScore,LocProb,Log2FChange,PQ-val,QuantSig,PEP,MassErrorPPM
AATLLSLGSHQR,ph,S,111,true,"SnRK2 protein kinase substrates",85,23776212,XCorr,2.2273126,0.9150000,,,,0.057923801243305,
AATLLSLGSHQR,ph,S,111,true,"atm and atr DNA damage response",88,25561503,"MASCOT Score",44.0000000,0.9810000,,,,,0.1000000
AATLLSLGSHQR,ph,S,111,true,"Tissue atlas Arabidopsis - ProteomicsDB",114,32188942,"MaxQuant score",256.9500000,0.9999960,,,,0,
AATLLSLGSHQR,ph,S,114,true,"atm and atr DNA damage response",88,25561503,"MASCOT Score",84.0000000,1.0000000,,,,,-0.1200000
AATLLSLGSHQR,ph,S,114,true,"Phospho cell culture sucrose/TOR",109,30833711,,,0.9980650,,,,,
AATLLSLGSHQR,ph,S,114,true,"Tissue atlas Arabidopsis - ProteomicsDB",114,32188942,"MaxQuant score",289.3800000,0.9999810,,,,0,
MDSRRDSSEVVAQR,ph,S,120,true,"TOR Kinase and ABA Receptor",100,29290610,XCorr,2.3277218,0.9735000,,,,0.025709999725223,
RDSSEVVAQR,ph,S,124,true,"atm and atr DNA damage response",88,25561503,"MASCOT Score",32.0000000,1.0000000,,,,,-0.5600000
RDSSEVVAQR,ph,S,124,true,"Tissue atlas Arabidopsis - ProteomicsDB",114,32188942,"MaxQuant score",94.6730000,0.9806780,,,,0.00048186001367867,
HRALLFK,me2,R,273,false,"Arabidopsis protein methylome",123,31809900,"MaxQuant Score",53.5540000,1.0000000,,,,0.0091028697788715,-2.2238000
LSEGEGSSHSSMANYSSSLDR,ph,S,367,true,"Tissue atlas Arabidopsis - ProteomicsDB",114,32188942,"MaxQuant score",186.3500000,0.9932090,,,,1.4012984643248E-44,
SGLNNVDDFHQQK,ph,S,476,true,"atm and atr DNA damage response",88,25561503,"MASCOT Score",35.0000000,1.0000000,,,,,-0.0700000
SGLNNVDDFHQQK,ph,S,476,true,"TOR Kinase and ABA Receptor",100,29290610,XCorr,3.8832569,1.0000000,,,,0.00014879999798723,
YGNTQSSYATSSSNGAISSNVHGR,fuc,T,535,true,"SPINDLY O-fucosylation",162,36739885,,,,,,,-0.55000001192093,
KYTSDDISTGCDPR,ph,S,621,true,"Tissue atlas Arabidopsis - ProteomicsDB",114,32188942,"MaxQuant score",110.6000000,0.9317390,,,,5.6685799791012E-5,
LKHNTFLSSK,ph,T,820,true,"Tissue atlas Arabidopsis - ProteomicsDB",114,32188942,"MaxQuant score",85.1630000,0.9999920,,,,0.00089753698557615,
HNTFLSSK,ph,S,823,true,"atm and atr DNA damage response",88,25561503,"MASCOT Score",50.0000000,0.9480000,,,,,-1.3100000
HNTFLSSK,ph,S,823,true,"Phospho cell culture sucrose/TOR",109,30833711,,,0.7769910,,,,,
HNTFLSSK,ph,S,823,true,"Tissue atlas Arabidopsis - ProteomicsDB",114,32188942,"MaxQuant score",155.1100000,0.9849410,,,,1.810019966797E-6,
STAGTPEWMAPEVLR,ph,S,826,false,"srk2dei ABA signaling phopshoproteomics",83,23572148,"MASCOT Score",41.0000000,,,,,,0.0025000
STAGTPEWMAPEVLR,ph,S,826,false,"Phospho cell culture sucrose/TOR",109,30833711,,,0.9204570,,,,,
STAGTPEWMAPEVLR,ph,T,827,false,"srk2dei ABA signaling phopshoproteomics",83,23572148,"MASCOT Score",41.0000000,,,,,,0.0025000
STAGTPEWMAPEVLR,ph,T,827,false,"atm and atr DNA damage response",88,25561503,"MASCOT Score",45.0000000,0.9480000,,,,,-1.6000000
STAGTPEWMAPEVLR,ph,T,827,false,"Tissue atlas Arabidopsis - ProteomicsDB",114,32188942,"MaxQuant score",242.9100000,0.9765980,,,,0,
STAGTPEWMAPEVLR,ph,T,830,false,"Tyrosine phosphorylation in Arabidopsis",59,18463617,"MASCOT Score",36.0000000,,,,,,-2.0884572
