Peptide,PTM,ModifiedAA,ModifiedPosition,PeptideUniqueToGene,ExperimentDesc,ExpID,PubmedID,ScoreType,IdentScore,LocProb,Log2FChange,PQ-val,QuantSig,PEP,MassErrorPPM
NHDVNQLGRENSHNMDYNAIAVR,ph,S,272,true,"TOR Kinase and ABA Receptor",100,29290610,XCorr,3.0820785,0.9998000,,,,6.1680002545472E-5,
ENSHNMDYNAIAVR,ph,S,272,true,"atm and atr DNA damage response",88,25561503,"MASCOT Score",42.0000000,1.0000000,,,,,0.4500000
ENSHNMDYNAIAVR,ph,S,272,true,"Tissue atlas Arabidopsis - ProteomicsDB",114,32188942,"MaxQuant score",244.0100000,1.0000000,,,,0,
DIDNVDDGIGNGSRGGLER,ph,S,296,true,"Tissue atlas Arabidopsis - ProteomicsDB",114,32188942,"MaxQuant score",170.4800000,1.0000000,,,,1.0274799758979E-15,
SPLVGSPSASEHSTSVGTR,ph,S,303,true,"Tissue atlas Arabidopsis - ProteomicsDB",114,32188942,"MaxQuant score",69.4700000,0.9997410,,,,1.0592300441203E-6,
SPLVGSPSASEHSTSVGTR,ph,S,308,true,"Tissue atlas Arabidopsis - ProteomicsDB",114,32188942,"MaxQuant score",184.5000000,0.9997550,,,,2.6136000156551E-36,
SPLVGSPSASEHSTSVGTR,ph,S,310,true,"Tissue atlas Arabidopsis - ProteomicsDB",114,32188942,"MaxQuant score",247.8600000,0.9723040,,,,0,
SPLVGSPSASEHSTSVGTR,ph,S,312,true,"Tissue atlas Arabidopsis - ProteomicsDB",114,32188942,"MaxQuant score",112.4800000,0.9255070,,,,8.0585697836977E-11,
SPLVGSPSASEHSTSVGTR,ph,S,315,true,"Tissue atlas Arabidopsis - ProteomicsDB",114,32188942,"MaxQuant score",153.8600000,0.8649220,,,,3.3585200155575E-19,
