Peptide,PTM,ModifiedAA,ModifiedPosition,PeptideUniqueToGene,ExperimentDesc,ExpID,PubmedID,ScoreType,IdentScore,LocProb,Log2FChange,PQ-val,QuantSig,PEP,MassErrorPPM
AASSAAGNPQSDADFNPYEVLGVNPIEGFDK,nta,A,59,true,"Characterization plant N-terminal acetylation",6,22223895,"MASCOT Score",40.5900000,,,,,,
ASSAAGNPQSDADFNPYEVLGVNPIEGFDKIKQTYGR,nt,A,60,true,"HUNTER N-terminome: legumain, GluC and trypsin",119,31951383,"MaxQuant score",123.5600000,,,,,,
ASSAAGNPQSDADFNPYE,nt,A,60,true,"HUNTER N-terminome: legumain, GluC and trypsin",119,31951383,"MaxQuant score",149.3500000,,,,,,
ASSAAGNPQSDADFNPYEVLGVNPIEGFDKIKQTYGR,nta,A,60,true,"HUNTER N-terminome: legumain, GluC and trypsin",119,31951383,"MaxQuant score",51.8680000,,,,,,
ASSAAGNPQSDADFNPYEVLGVNPIEGFDK,nta,A,60,true,"Characterization plant N-terminal acetylation",6,22223895,"MASCOT Score",41.2200000,,,,,,
ASSAAGNPQSDADFNPYE,nta,A,60,true,"HUNTER N-terminome: legumain, GluC and trypsin",119,31951383,"MaxQuant score",124.6200000,,,,,,
SGDEATAALLEKAYDK,ac,K,115,true,"Histone deacetylases - apicidin vs control",98a,29061669,"MaxQuant Score",50.3000000,1.0000000,-0.2770000,0.2944422,NO,1.6000000186978E-6,
GVTFGSFKVSK,ph,S,136,true,"STN8 phosphoproteome",38,21768351,"MASCOT Score",66.6800000,,,,,,-0.5869240
GVTFGSFKVSK,ph,S,136,true,"Chloroplast kinase substrates",60,19376835,"MASCOT Score",49.6300000,,,,,,-0.6192440
KKGVTFGSFK,ph,S,136,true,"STN8 phosphoproteome",38,21768351,"MASCOT Score",52.8500000,,,,,,0.2158500
KKGVTFGSFK,ph,S,136,true,"Chloroplast kinase substrates",60,19376835,"MASCOT Score",51.7000000,,,,,,0.2158500
KGVTFGSFK,ph,S,136,true,"STN8 phosphoproteome",38,21768351,"MASCOT Score",46.5800000,,,,,,0.7528390
KGVTFGSFK,ph,S,136,true,"Chloroplast kinase substrates",60,19376835,"MASCOT Score",47.0000000,,,,,,0.7528390
GVTFGSFK,ph,S,136,true,"Tyrosine phosphorylation in Arabidopsis",59,18463617,"MASCOT Score",42.0000000,,,,,,-1.0853066
GVTFGSFK,ph,S,136,true,"atm and atr DNA damage response",88,25561503,"MASCOT Score",41.0000000,1.0000000,,,,,1.0700000
GVTFGSFK,ph,S,136,true,"Tissue atlas Arabidopsis - ProteomicsDB",114,32188942,"MaxQuant score",169.7600000,1.0000000,,,,0.0020094900391996,
GVTFGSFKVSK,ac,K,138,true,"Histone deacetylases- hda14 vs WT (low light)",98c,29061669,"MaxQuant Score",148.1300000,1.0000000,5.5140000,0.0891251,NO,4.6000000111235E-6,
GVTFGSFKVSK,ac,K,138,true,"Histone deacetylases - hda14 vs WT (thylakoids)",98d,29061669,"MaxQuant Score",149.2000000,1.0000000,3.4760000,0.4864072,NO,2.3700000062149E-17,
YADKQPIIPWGPR,ac,K,148,true,"Histone deacetylases substrates - hda14 vs WT",98e,29061669,"MaxQuant Score",42.8000000,1.0000000,1.3470000,0.1849269,NO,0.003000000026077,
