Peptide,PTM,ModifiedAA,ModifiedPosition,PeptideUniqueToGene,ExperimentDesc,ExpID,PubmedID,ScoreType,IdentScore,LocProb,Log2FChange,PQ-val,QuantSig,PEP,MassErrorPPM
SFMSYVDLKK,ph,S,8,true,"Tissue atlas Arabidopsis - ProteomicsDB",114,32188942,"MaxQuant score",88.8300000,0.9997440,,,,0.001108180033043,
SFMSYVDLKK,ph,S,11,true,"atm and atr DNA damage response",88,25561503,"MASCOT Score",26.0000000,1.0000000,,,,,-2.7900000
SFMSYVDLKK,ph,S,11,true,"Tissue atlas Arabidopsis - ProteomicsDB",114,32188942,"MaxQuant score",169.2300000,1.0000000,,,,7.1454898886714E-8,
SFMSYVDLK,ph,S,11,true,"atm and atr DNA damage response",88,25561503,"MASCOT Score",47.0000000,0.9620000,,,,,-0.5800000
SFMSYVDLK,ph,S,11,true,"TOR Kinase and ABA Receptor",100,29290610,XCorr,3.0361288,0.9263000,,,,0.0047920001670718,
DMEAGPDFDLEMASTK,ph,S,35,true,"Tissue atlas Arabidopsis - ProteomicsDB",114,32188942,"MaxQuant score",132.8700000,0.8603470,,,,1.6222900356411E-8,
RLSGTPVYR,ph,S,124,true,"atm and atr DNA damage response",88,25561503,"MASCOT Score",27.0000000,0.9390000,,,,,0.2200000
RLSGTPVYR,ph,S,124,true,"TOR Kinase and ABA Receptor",100,29290610,XCorr,2.0586019,0.9312000,,,,0.016289999708533,
RLSGTPVYR,ph,S,124,true,"Tissue atlas Arabidopsis - ProteomicsDB",114,32188942,"MaxQuant score",150.0900000,0.9999680,,,,8.0073798017111E-5,
IITDNAGGEEFLTR,ph,T,197,true,"Tissue atlas Arabidopsis - ProteomicsDB",114,32188942,"MaxQuant score",100.6000000,1.0000000,,,,0.00035356401349418,
VLETVVEIQDR,ph,T,211,true,"Tissue atlas Arabidopsis - ProteomicsDB",114,32188942,"MaxQuant score",113.6900000,1.0000000,,,,8.470680040773E-5,
