Peptide,PTM,ModifiedAA,ModifiedPosition,PeptideUniqueToGene,ExperimentDesc,ExpID,PubmedID,ScoreType,IdentScore,LocProb,Log2FChange,PQ-val,QuantSig,PEP,MassErrorPPM
ANGADRLDLD,nt,A,2,true,"Arg/N-end rule seed, prt6 vs. Wt",99,29168982,"MASCOT Score",42.9100000,,,,,0.0058039999566972,6.8536837
ANGADRLD,nt,A,2,true,"Arg/N-end rule seed, prt6 vs. Wt",99,29168982,"MASCOT Score",33.3000000,,,,,0.0058659999631345,-0.9334312
ANGADRLDLD,nta,A,2,true,"Arg/N-end rule seed, prt6 vs. Wt",99,29168982,"MASCOT Score",42.9100000,,,,,0.0058039999566972,6.8536837
ANGADRLDLD,nta,A,2,true,"HUNTER N-terminome: legumain, GluC and trypsin",119,31951383,"MaxQuant score",182.7600000,,,,,,
ANGADRLDLD,nta,A,2,true,"Arabidopsis translation initiation landscape - NTA",167a,35069635,,,,,,,,
ANGADRLD,nta,A,2,true,"Arg/N-end rule seed, prt6 vs. Wt",99,29168982,"MASCOT Score",33.3000000,,,,,0.0058659999631345,-0.9334312
HLLEPDTVQWAGR,ph,T,63,true,"Tissue atlas Arabidopsis - ProteomicsDB",114,32188942,"MaxQuant score",162.4800000,1.0000000,,,,6.6206901072619E-10,
YCSENNK,sno,C,127,false,"hot5-4 / wildtype, FAT-switch S-nitrosoproteome",169,37277371,,,,,,,,
TIGSFLPK,ph,S,149,false,"atm and atr DNA damage response",88,25561503,"MASCOT Score",32.0000000,1.0000000,,,,,-3.6900000
EDISPCIFGSIEK,sno,C,173,false,"hot5-4 / wildtype, FAT-switch S-nitrosoproteome",169,37277371,,,,,,,,
EDISPCIFGSIEK,so,C,173,false,"S-sulfenylation site detection using YAP1C",110,32714340,,,,,,,,
EDISPCIFGSIEK,ph,S,177,false,"Tissue atlas Arabidopsis - ProteomicsDB",114,32188942,"MaxQuant score",157.3700000,1.0000000,,,,5.9623900261485E-10,
WSYACAK,ox,C,187,false,"OxiTRAQ Arabidopsis - 5 mM H2O2 versus control",47,24376095,,,,1.2500011,0.0047555,YES,,
WSYACAK,ox,C,187,false,"SPEAR - 50 mM H2O2 / mock",138b,34619326,,,,2.3986175,0.0182125,YES,,
WSYACAK,so,C,187,false,"S-sulfenylation site detection using YAP1C",110,32714340,,,,,,,,
VLACFSNNLLR,ph,S,241,false,"Tissue atlas Arabidopsis - ProteomicsDB",114,32188942,"MaxQuant score",68.4400000,1.0000000,,,,0.0041898200288415,
EPLKLVDGGESQR,nt,E,248,false,"Metacaspase9 substrates - in vitro rMC9",51c,23964026,"MASCOT Score",53.0000000,,,,,,-0.5105863
EPLKLVDGGESQR,ub,K,251,false,"Arabidopsis ubiquitination COFRADIC",40,26744219,"MaxQuant Score",48.5270000,1.0000000,,,,0.00077699997927994,0.2240000
EPLKLVDGGESQR,ub,K,251,false,"upl3 mutant / wildtype",168,35926874,"MaxQuant score",42.3170000,1.0000000,,,,0.0054059000685811,1.8834000
LVDGGESQR,nt,L,252,false,"Metacaspase9 substrates - in vitro rMC9",51c,23964026,"MASCOT Score",58.0000000,,1.4572229,,NO,,-0.2914009
GHIFNVGNPNNE,nt,G,284,false,"Arg/N-end rule seed, prt6 vs. Wt",99,29168982,"MASCOT Score",36.6700000,,,,,0.019859999418259,-1.9455083
VSGETAIESPTIDVSSK,ph,S,320,true,"srk2dei ABA signaling phopshoproteomics",83,23572148,"MASCOT Score",35.0000000,,,,,,-0.0019000
VSGETAIESPTIDVSSK,ph,S,320,true,"atm and atr DNA damage response",88,25561503,"MASCOT Score",37.0000000,1.0000000,,,,,-0.4900000
VSGETAIESPTIDVSSK,ph,S,320,true,"TOR Kinase and ABA Receptor",100,29290610,XCorr,4.8135471,0.8744000,,,,5.4280000767903E-5,
VSGETAIESPTIDVSSK,ph,S,320,true,"Lateral root-induction - NAA vs control",106,23328941,"MASCOT Score",46.0000000,,-0.1107024,0.5448154,NO,,
VSGETAIESPTIDVSSK,ph,S,320,true,"Tissue atlas Arabidopsis - ProteomicsDB",114,32188942,"MaxQuant score",249.8900000,0.9983420,,,,0,
EFYGEGYDDSDKRIPDMTIINR,nt,E,329,false,"Metacaspase9 substrates - Col-0 / mc9",51a,23964026,"MASCOT Score",53.0000000,,2.1851994,,NO,,-2.2879052
EFYGEGYDDSDKR,nt,E,329,false,"Metacaspase9 substrates - in vitro rMC9",51c,23964026,"MASCOT Score",81.0000000,,,,,,0.2325952
EFYGEGYDDSDKR,ac,K,340,false,"Quantitative Acetylproteomics",101,29440448,,,,,,,,
