Peptide,PTM,ModifiedAA,ModifiedPosition,PeptideUniqueToGene,ExperimentDesc,ExpID,PubmedID,ScoreType,IdentScore,LocProb,Log2FChange,PQ-val,QuantSig,PEP,MassErrorPPM
EFSSTTTLSR,ph,S,319,true,"Tissue atlas Arabidopsis - ProteomicsDB",114,32188942,"MaxQuant score",74.9620000,0.8194230,,,,0.0041759698651731,
EFSSTTTLSR,ph,S,320,true,"Tissue atlas Arabidopsis - ProteomicsDB",114,32188942,"MaxQuant score",91.3130000,0.8808030,,,,0.0011085199657828,
YAEAASLCPK,sno,C,458,true,"hot5-4 / wildtype, FAT-switch S-nitrosoproteome",169,37277371,,,,,,,,
AYELCVK,sno,C,704,true,"hot5-4 / wildtype, FAT-switch S-nitrosoproteome",169,37277371,,,,,,,,
HGCNDILK,sno,C,817,true,"hot5-4 / wildtype, FAT-switch S-nitrosoproteome",169,37277371,,,,,,,,
EDNNRSSFSQR,ph,S,859,true,"Tissue atlas Arabidopsis - ProteomicsDB",114,32188942,"MaxQuant score",115.1400000,0.8952760,,,,8.0628997238819E-6,
REDNNRSSFSQR,ph,S,860,true,"Tissue atlas Arabidopsis - ProteomicsDB",114,32188942,"MaxQuant score",128.5700000,0.9774390,,,,8.0628997238819E-6,
EDNNRSSFSQR,ph,S,860,true,"atm and atr DNA damage response",88,25561503,"MASCOT Score",42.0000000,0.9400000,,,,,0.6700000
MVVDKSLSIK,ph,S,870,true,"Tissue atlas Arabidopsis - ProteomicsDB",114,32188942,"MaxQuant score",100.6900000,0.9011540,,,,0.00076768198050559,
