Peptide,PTM,ModifiedAA,ModifiedPosition,PeptideUniqueToGene,ExperimentDesc,ExpID,PubmedID,ScoreType,IdentScore,LocProb,Log2FChange,PQ-val,QuantSig,PEP,MassErrorPPM
KGDTSPDIEQR,ph,T,109,true,"atm and atr DNA damage response",88,25561503,"MASCOT Score",24.0000000,1.0000000,,,,,-1.0400000
KGDTSPDIEQR,ph,T,109,true,"Tissue atlas Arabidopsis - ProteomicsDB",114,32188942,"MaxQuant score",123.7200000,0.9337670,,,,3.9969501813175E-5,
KGDTSPDIEQR,ph,S,110,true,"Phospho cell culture sucrose/TOR",109,30833711,,,0.9669210,,,,,
KGDTSPDIEQR,ph,S,110,true,"Tissue atlas Arabidopsis - ProteomicsDB",114,32188942,"MaxQuant score",162.1000000,0.9704040,,,,6.4420399570331E-11,
LKESEALVDASPNEEELVVVGCSR,ph,S,147,true,"Tissue atlas Arabidopsis - ProteomicsDB",114,32188942,"MaxQuant score",77.9950000,0.9953840,,,,4.1314600629505E-9,
RLPVDETSLDK,ph,S,199,true,"Tissue atlas Arabidopsis - ProteomicsDB",114,32188942,"MaxQuant score",52.0710000,0.9365920,,,,0.018756100907922,
IVLDASPIVETGDDSVIGSPSENLETQK,ph,S,235,true,"TOR Kinase and ABA Receptor",100,29290610,XCorr,5.7096329,0.9729000,,,,2.6280000383849E-5,
LPVGETSLEK,ph,S,269,true,"Tissue atlas Arabidopsis - ProteomicsDB",114,32188942,"MaxQuant score",124.6000000,0.7929910,,,,9.6318297437392E-5,
LPVGETSLEK,ph,S,302,true,"Tissue atlas Arabidopsis - ProteomicsDB",114,32188942,"MaxQuant score",124.6000000,0.7929910,,,,9.6318297437392E-5,
MVLYASPIVETR,ph,S,325,true,"Tissue atlas Arabidopsis - ProteomicsDB",114,32188942,"MaxQuant score",110.1500000,0.9994330,,,,6.629269773839E-5,
DDSVICSPSTNLETQK,ph,S,338,true,"Tissue atlas Arabidopsis - ProteomicsDB",114,32188942,"MaxQuant score",240.9200000,0.9998650,,,,0,
MLTHIKK,ph,T,569,true,"Phosphorylation in N starvation",63,22060019,"MASCOT Score",23.0000000,,,,,,9.6864400
SYEHGIYSSKK,ph,S,617,true,"Tissue atlas Arabidopsis - ProteomicsDB",114,32188942,"MaxQuant score",121.4500000,0.8253280,,,,4.1665098251542E-6,
KNSAINNFNK,ph,S,621,true,"Tissue atlas Arabidopsis - ProteomicsDB",114,32188942,"MaxQuant score",139.2800000,1.0000000,,,,5.8569198699843E-6,
VQYFEGSEASPK,ph,S,845,true,"Tissue atlas Arabidopsis - ProteomicsDB",114,32188942,"MaxQuant score",102.6200000,0.7906810,,,,0.00011212300159968,
VQYFEGSEASPK,ph,S,848,true,"atm and atr DNA damage response",88,25561503,"MASCOT Score",49.0000000,1.0000000,,,,,-0.8800000
VQYFEGSEASPK,ph,S,848,true,"Tissue atlas Arabidopsis - ProteomicsDB",114,32188942,"MaxQuant score",131.3500000,0.9987470,,,,3.64168008673E-5,
KKASDDVTDPR,ph,S,864,true,"Tissue atlas Arabidopsis - ProteomicsDB",114,32188942,"MaxQuant score",56.9370000,0.9994820,,,,0.0049652098678052,
DHMGALESPKVITLQSSCK,ph,S,895,true,"Tissue atlas Arabidopsis - ProteomicsDB",114,32188942,"MaxQuant score",216.8700000,1.0000000,,,,0,
DHMGALESPK,ph,S,895,true,"atm and atr DNA damage response",88,25561503,"MASCOT Score",32.0000000,1.0000000,,,,,-1.2400000
LVNESLSGATVR,ph,S,1085,true,"Tissue atlas Arabidopsis - ProteomicsDB",114,32188942,"MaxQuant score",79.3370000,0.9145860,,,,0.0015553400153294,
ITSAASDEDVSSR,ph,S,1379,true,"Lateral root-induction - NAA vs control",106,23328941,"MASCOT Score",21.0000000,,,,,,
ITSAASDEDVSSR,ph,S,1382,true,"atm and atr DNA damage response",88,25561503,"MASCOT Score",74.0000000,1.0000000,,,,,-0.1200000
ITSAASDEDVSSR,ph,S,1382,true,"Lateral root-induction - NAA vs control",106,23328941,"MASCOT Score",26.0000000,,,,,,
ITSAASDEDVSSR,ph,S,1382,true,"Phospho cell culture sucrose/TOR",109,30833711,,,0.9594970,,,,,
ITSAASDEDVSSR,ph,S,1382,true,"Tissue atlas Arabidopsis - ProteomicsDB",114,32188942,"MaxQuant score",227.3400000,1.0000000,,,,0,
VPEVSQSLENLSASPEFSLNR,ph,S,1403,true,"Tissue atlas Arabidopsis - ProteomicsDB",114,32188942,"MaxQuant score",350.5300000,1.0000000,,,,0,
AAQVSALR,ph,S,1841,true,"Tissue atlas Arabidopsis - ProteomicsDB",114,32188942,"MaxQuant score",128.3600000,1.0000000,,,,0.0029515300411731,
