Peptide,PTM,ModifiedAA,ModifiedPosition,PeptideUniqueToGene,ExperimentDesc,ExpID,PubmedID,ScoreType,IdentScore,LocProb,Log2FChange,PQ-val,QuantSig,PEP,MassErrorPPM
MENPNNLRE,nta,M,1,true,"Arabidopsis translation initiation landscape - NTA",167a,35069635,,,,,,,,
ESKSHLNLNECLTLPK,ph,S,10,true,"SnRK2 protein kinase substrates",85,23776212,XCorr,2.2545879,0.8660000,,,,0.030209699645638,
MENPNNLRESK,ph,S,10,true,"Tissue atlas Arabidopsis - ProteomicsDB",114,32188942,"MaxQuant score",118.9600000,1.0000000,,,,4.7793701440924E-8,
SHLNLNECLTLPK,ph,S,12,true,"STN8 phosphoproteome",38,21768351,"MASCOT Score",52.1000000,,,,,,
SHLNLNECLTLPK,ph,S,12,true,"Col-0 callus - FC Col-0 vs. Col-0 Xray",111a,31410901,,36.9200000,,0.9809809,0.0000000,NO,,2.5314854
SHLNLNECLTLPK,ph,S,12,true,"Col-0 X-ray callus - FC Col-0 vs. Col-0 Xray",111b,31410901,,36.9200000,,0.9809809,0.0000000,NO,,2.5314854
SHLNLNECLTLPK,ph,S,12,true,"atm callus - FC atm vs. atm Xray",111c,31410901,,36.9200000,,1.2747339,0.0000000,NO,,2.5314854
SHLNLNECLTLPK,ph,S,12,true,"atm-3 X-ray callus - FC atm vs. atm Xray",111d,31410901,,36.9200000,,1.2747339,0.0000000,NO,,2.5314854
SHLNLNECLTLPK,ph,S,12,true,"Tissue atlas Arabidopsis - ProteomicsDB",114,32188942,"MaxQuant score",274.6800000,1.0000000,,,,0,
SHLNLNECLTLPK,so,C,19,true,"S-sulfenylation site detection using YAP1C",110,32714340,,,,,,,,
SHLNLNECLTLPK,ph,T,21,true,"Tissue atlas Arabidopsis - ProteomicsDB",114,32188942,"MaxQuant score",113.2800000,1.0000000,,,,4.9291800678475E-5,
TLDPSSPSPSDASR,ph,S,29,true,"Lateral root-induction - NAA vs control",106,23328941,"MASCOT Score",36.0000000,,,,,,
TLDPSSPSPSDASR,ph,S,30,true,"atm and atr DNA damage response",88,25561503,"MASCOT Score",46.0000000,0.9960000,,,,,0.7500000
TLDPSSPSPSDASR,ph,S,30,true,"Lateral root-induction - NAA vs control",106,23328941,"MASCOT Score",35.0000000,,,,,,
TLDPSSPSPSDASR,ph,S,30,true,"Tissue atlas Arabidopsis - ProteomicsDB",114,32188942,"MaxQuant score",214.4700000,0.9998850,,,,0,
TLDPSSPSPSDASR,ph,S,32,true,"Phosphorylation Early Elicitor Signaling",23,17317660,,,,,,,,
TLDPSSPSPSDASR,ph,S,32,true,"atm and atr DNA damage response",88,25561503,"MASCOT Score",46.0000000,0.9960000,,,,,0.7500000
TLDPSSPSPSDASR,ph,S,32,true,"Phospho cell culture sucrose/TOR",109,30833711,,,0.7849950,,,,,
TLDPSSPSPSDASR,ph,S,32,true,"Tissue atlas Arabidopsis - ProteomicsDB",114,32188942,"MaxQuant score",196.3700000,0.9319370,,,,1.030619961808E-31,
SSVDPNRPDSSSSRPGSTPSSSGLR,ph,S,48,true,"Tissue atlas Arabidopsis - ProteomicsDB",114,32188942,"MaxQuant score",135.7000000,0.8948010,,,,2.8055198803008E-35,
SSVDPNRPDSSSSRPGSTPSSSGLR,fuc,S,51,true,"SPINDLY O-fucosylation",162,36739885,,,,,,,0.14000000059605,
QVPLCDVDSVPTFVAQR,sno,C,122,true,"hot5-4 / wildtype, FAT-switch S-nitrosoproteome",169,37277371,,,,,,,,
FLVSQAMSEAR,ph,S,516,true,"Tissue atlas Arabidopsis - ProteomicsDB",114,32188942,"MaxQuant score",60.3640000,0.9985480,,,,0.0026199799031019,
AYAFSSMSSHSAQR,ph,S,584,true,"Tissue atlas Arabidopsis - ProteomicsDB",114,32188942,"MaxQuant score",111.8800000,0.8814280,,,,6.8938999902457E-5,
AYAFSSMSSHSAQR,ph,S,585,true,"Tissue atlas Arabidopsis - ProteomicsDB",114,32188942,"MaxQuant score",109.3800000,0.8338540,,,,2.0827599655604E-5,
AYAFSSMSSHSAQR,ph,S,588,true,"Tissue atlas Arabidopsis - ProteomicsDB",114,32188942,"MaxQuant score",147.1700000,0.9340550,,,,1.1955900447447E-7,
AYAFSSMSSHSAQR,ph,S,590,true,"Tissue atlas Arabidopsis - ProteomicsDB",114,32188942,"MaxQuant score",129.0100000,0.9984500,,,,3.0598299449736E-9,
GDSTQGFSPVQAYQTSPMAR,ph,S,605,true,"Tissue atlas Arabidopsis - ProteomicsDB",114,32188942,"MaxQuant score",242.2200000,0.9999880,,,,0,
GDSTQGFSPVQAYQTSPMAR,ph,T,612,true,"Tissue atlas Arabidopsis - ProteomicsDB",114,32188942,"MaxQuant score",277.6400000,0.7501680,,,,0,
GDSTQGFSPVQAYQTSPMAR,ph,S,613,true,"Tissue atlas Arabidopsis - ProteomicsDB",114,32188942,"MaxQuant score",314.2900000,0.9289180,,,,0,
LVLESPTKPSPGRGEQS,nt,L,625,true,"Metacaspase9 substrates - Col-0 / mc9",51a,23964026,"MASCOT Score",56.0000000,,1.0021432,,NO,,-2.0822276
SQLLVLESPTKPSPGRGEQS,ph,S,629,true,"Tissue atlas Arabidopsis - ProteomicsDB",114,32188942,"MaxQuant score",243.3500000,0.9983830,,,,0,
SQLLVLESPTKPSPGR,ph,S,629,true,"atm and atr DNA damage response",88,25561503,"MASCOT Score",42.0000000,0.9930000,,,,,-1.9500000
SQLLVLESPTKPSPGRGEQS,ph,S,634,true,"Tissue atlas Arabidopsis - ProteomicsDB",114,32188942,"MaxQuant score",267.5600000,0.9992340,,,,0,
