Peptide,PTM,ModifiedAA,ModifiedPosition,PeptideUniqueToGene,ExperimentDesc,ExpID,PubmedID,ScoreType,IdentScore,LocProb,Log2FChange,PQ-val,QuantSig,PEP,MassErrorPPM
VLPTTYGELRPPLGK,ph,Y,325,false,"Phospho cell culture sucrose/TOR",109,30833711,,,1.0000000,,,,,
DCDLIGK,sno,C,407,true,"hot5-4 / wildtype, FAT-switch S-nitrosoproteome",169,37277371,,,,,,,,
FLLSDRDSNLLGDSQPTVAASGK,ph,S,433,true,"TOR Kinase and ABA Receptor",100,29290610,XCorr,3.2394044,1.0000000,,,,0.00026770000113174,
DSNLLGDSQPTVAASGK,ph,S,433,true,"Tissue atlas Arabidopsis - ProteomicsDB",114,32188942,"MaxQuant score",232.1000000,0.9999990,,,,0,
TRDSDEEDRDYDVAALANNLSQAFR,ph,T,505,true,"srk2dei ABA signaling phopshoproteomics",83,23572148,"MASCOT Score",80.0000000,,,,,,0.0016000
TRDSDEEDRDYDVAALANNLSQAFR,ph,T,505,true,"Brassinosteroid-Regulated Phosphorylation Dynamics",94,26187819,"MaxQuant Score",119.1800000,0.7740000,,,,6.6010001908978E-9,1.3320000
TRDSDEEDRDYDVAALANNLSQAFR,ph,S,508,true,"Arabidopsis root NAA phosphoproteome",18a,27643528,"MaxQuant Score",146.5700000,0.9990000,,,,1.6790000220471E-34,0.1260000
TRDSDEEDRDYDVAALANNLSQAFR,ph,S,508,true,"Large-scale phosphorylation discovery",44,23111157,XCorr,4.0830000,,,,,,
TRDSDEEDRDYDVAALANNLSQAFR,ph,S,508,true,"srk2dei ABA signaling phopshoproteomics",83,23572148,"MASCOT Score",85.0000000,,,,,,0.0006000
TRDSDEEDRDYDVAALANNLSQAFR,ph,S,508,true,"Brassinosteroid-Regulated Phosphorylation Dynamics",94,26187819,"MaxQuant Score",120.6400000,0.9640000,,,,1.2019999579005E-11,-0.2930000
TRDSDEEDRDYDVAALANNLSQAFR,ph,S,508,true,"TOR Kinase and ABA Receptor",100,29290610,XCorr,5.4475517,0.9923000,,,,2.7489999165908E-9,
TRDSDEEDRDYDVAALANNLSQAFR,ph,S,508,true,"Phospho cell culture sucrose/TOR",109,30833711,,,0.8112260,,,,,
TRDSDEEDRDYDVAALANNLSQAFR,ph,S,508,true,"Tissue atlas Arabidopsis - ProteomicsDB",114,32188942,"MaxQuant score",207.9700000,0.9983900,,,,0,
TRDSDEEDRDYDVAALANNLSQAFR,ph,Y,515,true,"Conserved plant phosphoproteome - Arabidopsis",61a,20466843,"MASCOT Score",73.0000000,1.0000000,,,,,
FGSTPSDTAGSNTIDVELNK,ph,T,592,true,"Tissue atlas Arabidopsis - ProteomicsDB",114,32188942,"MaxQuant score",335.1400000,0.9961920,,,,0,
TYNANTSSSDDDEVVVGEEDDDLTGNPK,ph,S,617,true,"srk2dei ABA signaling phopshoproteomics",83,23572148,"MASCOT Score",47.0000000,,,,,,-0.0003000
TYNANTSSSDDDEVVVGEEDDDLTGNPK,ph,S,617,true,"Col-0 callus - FC Col-0 vs. Col-0 Xray",111a,31410901,,43.5000000,,1.6158462,0.0389147,YES,,1.6741487
TYNANTSSSDDDEVVVGEEDDDLTGNPK,ph,S,617,true,"Col-0 X-ray callus - FC Col-0 vs. Col-0 Xray",111b,31410901,,43.5000000,,1.6158462,0.0389147,YES,,1.6741487
TYNANTSSSDDDEVVVGEEDDDLTGNPK,ph,S,617,true,"atm callus - FC atm vs. atm Xray",111c,31410901,,43.5000000,,0.7796810,0.2035666,NO,,1.6741487
TYNANTSSSDDDEVVVGEEDDDLTGNPK,ph,S,617,true,"atm-3 X-ray callus - FC atm vs. atm Xray",111d,31410901,,43.5000000,,0.7796810,0.2035666,NO,,1.6741487
