Peptide,PTM,ModifiedAA,ModifiedPosition,PeptideUniqueToGene,ExperimentDesc,ExpID,PubmedID,ScoreType,IdentScore,LocProb,Log2FChange,PQ-val,QuantSig,PEP,MassErrorPPM
DSGKSTTTGHLIYKLGGI,nt,D,17,false,"Arabidopsis translation initiation landscape - NT",167b,35069635,,,,,,,,
STTTGHLIYK,ph,T,22,false,"atm and atr DNA damage response",88,25561503,"MASCOT Score",47.0000000,0.9590000,,,,,-0.4800000
STTTGHLIYK,ph,T,22,false,"Tissue atlas Arabidopsis - ProteomicsDB",114,32188942,"MaxQuant score",154.0500000,0.8681800,,,,2.6383099793748E-6,
STTTGHLIYK,ac,K,30,false,"Quantitative Acetylproteomics",101,29440448,,,,,,,,
LGGIDKR,ac,K,36,false,"Lysine acetylation gel-based Arabidopsis",36,21311030,"MASCOT Score",26.0000000,,,,,,-0.0113000
LGGIDKR,me2,K,36,false,"Arabidopsis protein methylome",123,31809900,"MaxQuant Score",114.1900000,1.0000000,,,,0.00045323898666538,-1.6450000
LGGIDKR,me3,K,36,false,"Arabidopsis protein methylome",123,31809900,"MaxQuant Score",68.7000000,1.0000000,,,,0.0044927299022675,-0.3645500
FEKEAAEMNKR,nta,F,42,false,"Arabidopsis translation initiation landscape - NTA",167a,35069635,,,,,,,,
FEKEAAEMNK,me1,K,44,false,"Arabidopsis protein methylome",123,31809900,"MaxQuant Score",164.0400000,1.0000000,,,,0,-3.8317000
FEKEAAEMNKR,me2,K,44,false,"Arabidopsis protein methylome",123,31809900,"MaxQuant Score",155.9900000,1.0000000,,,,1.0637799853237E-35,0.6511100
FEKEAAEMNK,me3,K,44,false,"Arabidopsis protein methylome",123,31809900,"MaxQuant Score",115.3300000,1.0000000,,,,6.2282698529842E-13,-2.1463000
VIERFEKEAAEMNKR,ac,K,51,false,"Quantitative Acetylproteomics",101,29440448,,,,,,,,
FEKEAAEMNKR,ac,K,51,false,"Quantitative Acetylproteomics",101,29440448,,,,,,,,
EAAEMNKR,ac,K,51,false,"Quantitative Acetylproteomics",101,29440448,,,,,,,,
SFKYAWVLDK,me2,K,55,false,"Arabidopsis protein methylome",123,31809900,"MaxQuant Score",168.0200000,1.0000000,,,,0,0.1494300
YAWVLDKLK,ac,K,62,false,"Quantitative Acetylproteomics",101,29440448,,,,,,,,
GITIDIALWKFETTK,ac,K,79,false,"Lysine acetylation gel-based Arabidopsis",36,21311030,"MASCOT Score",65.0000000,,,,,,-0.1027000
GITIDIALWKFETTK,ac,K,79,false,"Lysine acetylation gel-based Finkemeier et al",37,21311031,i-probability,0.9999990,,,,,,
GITIDIALWKFETTK,me3,K,79,false,"Arabidopsis protein methylome",123,31809900,"MaxQuant Score",75.3160000,0.9964730,,,,4.2242901037782E-15,2.2443000
TTKYYCTVIDAPGHR,nt,T,82,false,"HUNTER N-terminome: legumain, GluC and trypsin",119,31951383,"MaxQuant score",47.0370000,,,,,,
TKYYCTVIDAPGHR,nt,T,83,false,"FtsH12 N-terminome: WT / FtsH12 knockdown miRNA",118,33216923,"MaxQuant score",98.6760000,,,,,1.1799999811046E-5,
TKYYCTVIDAPGHR,nt,T,83,false,"HUNTER N-terminome: legumain, GluC and trypsin",119,31951383,"MaxQuant score",47.6210000,,,,,,
YCTVIDAPGHRDF,nt,Y,86,false,"Arabidopsis translation initiation landscape - NT",167b,35069635,,,,,,,,
YYCTVIDAPGHR,ox,C,87,false,"OxiTRAQ Arabidopsis - 5 mM H2O2 versus control",47,24376095,,,,0.0129784,0.2823031,NO,,
YYCTVIDAPGHR,sno,C,87,false,"Endogenous S-nitrosylation in Arabidopsis",64,22115780,"MASCOT Score",67.0000000,,,,,,
YYCTVIDAPGHR,sno,C,87,false,"Cold stress nitrosylation - 4°C vs 22°C",65,24388526,,,,,,,,
YYCTVIDAPGHR,sno,C,87,false,"Site-specific nitrosomeproteomic id - gsnor1-3",90a,25699590,XCorr,4.3382225,,,,,0.0059380000457168,-5.9710768
YYCTVIDAPGHR,sno,C,87,false,"Site-specific nitrosomeproteomic id - gsnor1-3",90b,25699590,XCorr,4.7600000,,,,,0.0020840000361204,-5.8700000
YYCTVIDAPGHR,sno,C,87,false,"hot5-4 / wildtype, FAT-switch S-nitrosoproteome",169,37277371,,,,0.2152061,0.1273343,NO,,
YYCTVIDAPGHRDFIK,so,C,87,false,"S-sulfenylation site detection using YAP1C",110,32714340,,,,,,,,
YYCTVIDAPGHR,so,C,87,false,"Arabidopsis S-sulfenylation chemoproteomics",108,31578252,"pFind PSM Score",0.0001018,,1.0669600,,,,-0.5770136
TVIDAPGHR,nt,T,88,false,"Arg/N-end rule seed, prt6 vs. Wt",99,29168982,"MASCOT Score",46.4100000,,-0.1751230,0.3241799,NO,0.049959998577833,-0.7570415
DFIKNMITGTSQA,nt,D,97,false,"Arabidopsis translation initiation landscape - NT",167b,35069635,,,,,,,,
NMITGTSQADCAVLIIDSTTGGFEAGISK,so,C,111,false,"S-sulfenylation site detection using YAP1C",110,32714340,,,,,,,,
AVLIIDSTTGGFE,nt,A,112,false,"Arg/N-end rule seed, prt6 vs. Wt",99,29168982,"MASCOT Score",43.4000000,,-0.9383247,0.2570010,NO,9.8409997008275E-5,2.9272508
IDSTTGGFE,nt,I,116,false,"Arg/N-end rule seed, prt6 vs. Wt",99,29168982,"MASCOT Score",57.6100000,,0.4935973,0.1096571,NO,0.0015089999651536,-0.2957797
DSTTGGFEAGISK,nt,D,117,false,"Arabidopsis translation initiation landscape - NT",167b,35069635,,,,,,,,
DSTTGGFE,nt,D,117,false,"Arg/N-end rule seed, prt6 vs. Wt",99,29168982,"MASCOT Score",43.8500000,,0.5025790,0.0207064,NO,0.062180001288652,0.1055560
STTGGFEAGISKDGQTR,nt,S,118,false,"Arg/N-end rule seed, prt6 vs. Wt",99,29168982,"MASCOT Score",22.7700000,,-0.4838056,0.0822710,NO,0.0029629999771714,-1.3917073
STTGGFEAGISKDGQTR,nt,S,118,false,"FtsH12 N-terminome: WT / FtsH12 knockdown miRNA",118,33216923,"MaxQuant score",90.3160000,,,,,6.1999999161344E-6,
VKQMICCCNKMDATTPKYSKARYDE,nt,V,145,false,"Arabidopsis translation initiation landscape - NT",167b,35069635,,,,,,,,
QMICCCNK,ox,C,150,false,"OxiTRAQ Arabidopsis - 5 mM H2O2 versus control",47,24376095,,,,-0.2738661,0.1158823,NO,,
QMICCCNK,so,C,150,false,"Arabidopsis S-sulfenylation chemoproteomics",108,31578252,"pFind PSM Score",0.0717882,,,,,,-0.9691165
QMICCCNK,so,C,150,false,"S-sulfenylation site detection using YAP1C",110,32714340,,,,,,,,
QMICCCNK,ox,C,151,false,"OxiTRAQ Arabidopsis - 5 mM H2O2 versus control",47,24376095,,,,-0.2738661,0.1158823,NO,,
QMICCCNK,so,C,151,false,"Arabidopsis S-sulfenylation chemoproteomics",108,31578252,"pFind PSM Score",0.0717882,,,,,,-0.9691165
QMICCCNK,so,C,151,false,"S-sulfenylation site detection using YAP1C",110,32714340,,,,,,,,
QMICCCNK,ox,C,152,false,"OxiTRAQ Arabidopsis - 5 mM H2O2 versus control",47,24376095,,,,-0.2738661,0.1158823,NO,,
QMICCCNK,so,C,152,false,"Arabidopsis S-sulfenylation chemoproteomics",108,31578252,"pFind PSM Score",0.0717882,,0.9615400,,,,-0.9691165
QMICCCNK,so,C,152,false,"S-sulfenylation site detection using YAP1C",110,32714340,,,,,,,,
KMDATTPKYSKARYDE,nt,K,154,false,"Arabidopsis translation initiation landscape - NT",167b,35069635,,,,,,,,
MDATTPKYSKAR,nt,M,155,false,"Arabidopsis translation initiation landscape - NT",167b,35069635,,,,,,,,
MDATTPKYSK,ac,K,161,false,"Histone deacetylases - apicidin vs control",98a,29061669,"MaxQuant Score",122.7000000,1.0000000,-0.1460000,0.4688134,NO,0.0020000000949949,
MDATTPKYSK,ac,K,161,false,"Histone deacetylases- hda14 vs WT (low light)",98c,29061669,"MaxQuant Score",126.1900000,1.0000000,0.0310000,0.9931160,NO,0.0020000000949949,
MDATTPKYSK,cr,K,161,false,"Open search Plant PTM Viewer 2.0 - Crotonylation",164c,TBA,,,,,,,,
MDATTPKYSK,hib,K,161,false,"Open search Plant PTM Viewer 2.0 - hib",164e,TBA,,,,,,,,
SKARYDEIIKEVSSY,nt,S,163,false,"Arabidopsis translation initiation landscape - NT",167b,35069635,,,,,,,,
YDEIIKEVSSYLK,ac,K,172,false,"Histone deacetylases - apicidin vs control",98a,29061669,"MaxQuant Score",164.0000000,1.0000000,0.1240000,0.6039486,NO,4.8999998442743E-36,
YDEIIKEVSSYLK,ac,K,172,false,"Histone deacetylases - hda14 vs WT (thylakoids)",98d,29061669,"MaxQuant Score",88.8000000,1.0000000,0.3970000,0.8394600,NO,1.2999999853491E-5,
ARYDEIIKEVSSYLK,cr,K,172,false,"Open search Plant PTM Viewer 2.0 - Crotonylation",164c,TBA,,,,,,,,
YDEIIKEVSSYLK,cr,K,172,false,"Open search Plant PTM Viewer 2.0 - Crotonylation",164c,TBA,,,,,,,,
ARYDEIIKEVSSYLK,hib,K,172,false,"Open search Plant PTM Viewer 2.0 - hib",164e,TBA,,,,,,,,
YDEIIKEVSSYLK,hib,K,172,false,"Open search Plant PTM Viewer 2.0 - hib",164e,TBA,,,,,,,,
EVSSYLKK,ph,S,176,false,"Tissue atlas Arabidopsis - ProteomicsDB",114,32188942,"MaxQuant score",143.0300000,0.9854430,,,,0.0016071900026873,
EVSSYLKK,ph,Y,177,false,"atm and atr DNA damage response",88,25561503,"MASCOT Score",35.0000000,0.9980000,,,,,-2.6600000
EVSSYLKK,ac,K,179,false,"Histone deacetylases - apicidin vs control",98a,29061669,"MaxQuant Score",146.7000000,1.0000000,0.0250000,0.9375620,NO,1.1999999571799E-7,
EVSSYLKK,ac,K,179,false,"Histone deacetylases substrates - TSA vs control",98b,29061669,"MaxQuant Score",146.7000000,1.0000000,0.0290000,0.9977001,NO,1.1999999571799E-7,
EVSSYLKK,ac,K,179,false,"Histone deacetylases- hda14 vs WT (low light)",98c,29061669,"MaxQuant Score",128.1200000,1.0000000,2.5860000,0.9885531,NO,0.017000000923872,
EVSSYLKK,ac,K,179,false,"Histone deacetylases - hda14 vs WT (thylakoids)",98d,29061669,"MaxQuant Score",97.6000000,1.0000000,0.2570000,0.8394600,NO,0.013000000268221,
EVSSYLKK,ac,K,179,false,"Quantitative Acetylproteomics",101,29440448,,,,,,,,
EVSSYLKK,me2,K,179,false,"Arabidopsis protein methylome",123,31809900,"MaxQuant Score",85.6760000,1.0000000,,,,0.0056435000151396,-0.3170000
VGYNPDKIPFVPISGFEGDNMIER,ac,K,187,false,"Lysine acetylation gel-based Arabidopsis",36,21311030,"MASCOT Score",57.0000000,,,,,,-0.0581000
VGYNPDKIPFVPISGFEGDNMIER,ac,K,187,false,"Lysine acetylation gel-based Finkemeier et al",37,21311031,i-probability,0.9999990,,,,,,
VGYNPDKIPFVPISGFEGDNMIER,me3,K,187,false,"Arabidopsis protein methylome",123,31809900,"MaxQuant Score",145.3300000,1.0000000,,,,0,-0.3573200
PFVPISGFE,nt,P,189,false,"Arg/N-end rule seed, prt6 vs. Wt",99,29168982,"MASCOT Score",36.4900000,,-0.0655214,0.7610770,NO,0.0049350000917912,-3.2505498
MIERSTNL,nt,M,201,false,"Arabidopsis translation initiation landscape - NT",167b,35069635,,,,,,,,
ALDQINEPKRPSDKPLRLPLQDVYKIGGIGTVPVGRVE,ac,K,227,false,"Lysine acetylation gel-based Arabidopsis",36,21311030,"MASCOT Score",42.0000000,,,,,,-0.3255000
GPTLLEALDQINEPKRPSDKPLR,ac,K,227,false,"Lysine acetylation gel-based Arabidopsis",36,21311030,"MASCOT Score",91.0000000,,,,,,-0.3014000
GPTLLEALDQINEPKRPSDK,me2,K,227,false,"Arabidopsis protein methylome",123,31809900,"MaxQuant Score",231.1300000,1.0000000,,,,0,0.5839900
GPTLLEALDQINEPKR,me3,K,227,false,"Arabidopsis protein methylome",123,31809900,"MaxQuant Score",151.3800000,1.0000000,,,,0,0.0515510
LPLQDVYKIGGIGTVPVGR,nt,L,236,false,"Arabidopsis translation initiation landscape - NT",167b,35069635,,,,,,,,
DVYKIGGIGTVPVGR,nt,D,240,false,"Arg/N-end rule pathway Roots",80,25728785,"MASCOT Score",34.1300000,,,,,0.015969999134541,
LPLQDVYKIGGIGTVPVGR,ac,K,243,false,"Histone deacetylases substrates - TSA vs control",98b,29061669,"MaxQuant Score",89.9000000,1.0000000,-1.3180000,0.4988845,NO,1.3999999944059E-11,
LPLQDVYKIGGIGTVPVGR,ac,K,243,false,"Histone deacetylases - hda14 vs WT (thylakoids)",98d,29061669,"MaxQuant Score",82.3000000,1.0000000,1.0300000,0.7277798,NO,2.6899998895047E-10,
LPLQDVYKIGGIGTVPVGR,hib,K,243,false,"Open search Plant PTM Viewer 2.0 - hib",164e,TBA,,,,,,,,
LPLQDVYKIGGIGTVPVGR,ub,K,243,false,"Arabidopsis ubiquitination COFRADIC",40,26744219,"MaxQuant Score",66.1520000,1.0000000,,,,7.4079997236347E-14,-0.1490000
LPLQDVYKIGGIGTVPVGR,ub,K,243,false,"upl3 mutant / wildtype",168,35926874,"MaxQuant score",78.7800000,1.0000000,0.7527486,0.1644160,NO,1.2812400200346E-5,0.9947100
IGGIGTVPVGRVE,nt,I,244,false,"Arg/N-end rule seed, prt6 vs. Wt",99,29168982,"MASCOT Score",28.5400000,,0.0453251,0.8797650,NO,2.200999915658E-5,-0.5900127
IGGIGTVPVGR,nt,I,244,false,"Stromal N-terminome",96,26371235,"MASCOT Score",52.3900000,,,,,,
IGGIGTVPVGR,nt,I,244,false,"Arg/N-end rule seed, prt6 vs. Wt",99,29168982,"MASCOT Score",24.6700000,,-0.0755485,0.8280671,NO,0.14329999685287,-1.1374065
GGIGTVPVGRVE,nt,G,245,false,"Arg/N-end rule seed, prt6 vs. Wt",99,29168982,"MASCOT Score",28.6900000,,0.0176231,0.9252465,NO,0.00021959999867249,-1.5564838
GGIGTVPVGR,nt,G,245,false,"Arg/N-end rule seed, prt6 vs. Wt",99,29168982,"MASCOT Score",30.2800000,,0.2382014,0.1789954,NO,0.067110002040863,-0.4266211
GIGTVPVGRVE,nt,G,246,false,"Arg/N-end rule seed, prt6 vs. Wt",99,29168982,"MASCOT Score",23.2500000,,0.1051316,0.6712575,NO,0.00013139999646228,0.0387134
VVTFAPTGLTTE,nt,V,265,false,"Arg/N-end rule seed, prt6 vs. Wt",99,29168982,"MASCOT Score",43.6800000,,,,,0.0060609998181462,-1.2762656
VTFAPTGLTTE,nt,V,266,false,"Arg/N-end rule seed, prt6 vs. Wt",99,29168982,"MASCOT Score",24.2400000,,0.0934907,0.6140856,NO,0.017300000414252,-3.3802016
TFAPTGLTTE,nt,T,267,false,"Arg/N-end rule seed, prt6 vs. Wt",99,29168982,"MASCOT Score",55.7700000,,0.1728535,0.5833924,NO,0.00019449999672361,-1.2838086
SVEMHHESLLEALPGDNVGFNVK,epg,E,289,false,"Open search Plant PTM Viewer 2.0 - epg",164g,TBA,,,,,,,,
ALPGDNVG,nt,A,290,false,"Arg/N-end rule seed, prt6 vs. Wt",99,29168982,"MASCOT Score",60.0900000,,-0.0438849,0.9230724,NO,0.052129998803139,-0.1637610
NVAVKDLK,ac,K,306,false,"Lysine acetylation gel-based Arabidopsis",36,21311030,"MASCOT Score",36.0000000,,,,,,0.0505000
NVAVKDLK,me2,K,306,false,"Arabidopsis protein methylome",123,31809900,"MaxQuant Score",119.7500000,1.0000000,,,,0.00016479099576827,-0.4798100
NVAVKDLK,me3,K,306,false,"Arabidopsis protein methylome",123,31809900,"MaxQuant Score",101.6500000,1.0000000,,,,0.00038825499359518,0.0498340
DLKRGYVASNSKD,nt,D,307,false,"Arabidopsis translation initiation landscape - NT",167b,35069635,,,,,,,,
NVAVKDLKR,ac,K,309,false,"Quantitative Acetylproteomics",101,29440448,,,,,,,,
GYVASNSKDDPAK,ac,K,318,false,"Histone deacetylases - apicidin vs control",98a,29061669,"MaxQuant Score",160.5000000,1.0000000,-0.1390000,0.4613176,NO,1.3999999555717E-20,
GYVASNSKDDPAK,ac,K,318,false,"Histone deacetylases substrates - TSA vs control",98b,29061669,"MaxQuant Score",160.5000000,1.0000000,0.0660000,0.9977001,NO,1.3999999555717E-20,
GYVASNSKDDPAK,ac,K,318,false,"Histone deacetylases- hda14 vs WT (low light)",98c,29061669,"MaxQuant Score",295.7800000,1.0000000,-0.1090000,0.9885531,NO,1.0999999565762E-38,
GYVASNSKDDPAK,ac,K,318,false,"Histone deacetylases - hda14 vs WT (thylakoids)",98d,29061669,"MaxQuant Score",82.1000000,1.0000000,0.3900000,0.8394600,NO,8.6699998064432E-5,
GYVASNSKDDPAK,ac,K,318,false,"Histone deacetylases substrates - hda14 vs WT",98e,29061669,"MaxQuant Score",46.1000000,1.0000000,0.1400000,0.9099133,NO,0.003000000026077,
GYVASNSKDDPAK,ac,K,318,false,"Quantitative Acetylproteomics",101,29440448,,,,,,,,
GYVASNSKDDPAK,cr,K,318,false,"Open search Plant PTM Viewer 2.0 - Crotonylation",164c,TBA,,,,,,,,
GYVASNSKDDPAK,hib,K,318,false,"Open search Plant PTM Viewer 2.0 - hib",164e,TBA,,,,,,,,
GAANFTSQVIIMNHPGQIGNGYAPVLDCHTSHIAVK,ox,C,351,false,"OxiTRAQ SA and flg22 responses - SA vs mock",91a,25720653,"MASCOT Score",35.7600000,,0.6040713,0.0000000,YES,,
GAANFTSQVIIMNHPGQIGNGYAPVLDCHTSHIAVK,ox,C,351,false,"OxiTRAQ SA and flg22 responses - flg22 vs mock",91b,25720653,"MASCOT Score",35.7600000,,0.5360529,0.0010000,NO,,
VIIMNHPGQIGNGYAPVLDCHTSHIAVK,sno,C,351,false,"Site-specific nitrosomeproteomic id - gsnor1-3",90a,25699590,XCorr,2.2296722,,,,,0.045510001480579,-2.7696770
VIIMNHPGQIGNGYAPVLDCHTSHIAVK,sno,C,351,false,"Site-specific nitrosomeproteomic id - gsnor1-3",90b,25699590,XCorr,3.1500000,,,,,0.0088120000436902,-3.3700000
GAANFTSQVIIMNHPGQIGNGYAPVLDCHTSHIAVK,so,C,351,false,"S-sulfenylation site detection using YAP1C",110,32714340,,,,,,,,
FSEILTKIDRR,ac,K,366,false,"Quantitative Acetylproteomics",101,29440448,,,,,,,,
RSGKEIEK,ac,K,373,false,"Quantitative Acetylproteomics",101,29440448,,,,,,,,
SGKEIEK,ac,K,373,false,"Quantitative Acetylproteomics",101,29440448,,,,,,,,
EIEKEPKFLK,me2,K,380,false,"Arabidopsis protein methylome",123,31809900,"MaxQuant Score",85.8130000,0.9988530,,,,7.1142000024338E-7,0.3318900
EPKFLKNGDAGMVK,me3,K,380,false,"Arabidopsis protein methylome",123,31809900,"MaxQuant Score",63.1850000,1.0000000,,,,6.9049900048412E-5,0.7350500
EPKFLKNGDAGMVK,me3,K,383,false,"Arabidopsis protein methylome",123,31809900,"MaxQuant Score",63.1850000,1.0000000,,,,6.9049900048412E-5,0.7350500
FLKNGDAGMVK,me3,K,383,false,"Arabidopsis protein methylome",123,31809900,"MaxQuant Score",73.6320000,1.0000000,,,,6.9049900048412E-5,-0.3562500
MTPTKPMVVETFSEYPPLGR,ph,T,393,false,"Arabidopsis root NAA phosphoproteome",18a,27643528,"MaxQuant Score",102.1600000,0.9410000,,,,1.6029999593339E-12,0.1220000
MTPTKPMVVETFSEYPPLGR,ph,T,393,false,"Phospho cell culture sucrose/TOR",109,30833711,,,0.9899420,,,,,
MTPTKPMVVETFSEYPPLGR,ph,T,393,false,"Tissue atlas Arabidopsis - ProteomicsDB",114,32188942,"MaxQuant score",274.2700000,0.9998360,,,,0,
MTPTKPMVVETFSEYPPLGR,ph,T,395,false,"SnRK2 protein kinase substrates",85,23776212,XCorr,3.1402836,0.8900000,,,,0.0011470699682832,
MTPTKPMVVETFSEYPPLGR,ph,T,395,false,"TOR Kinase and ABA Receptor",100,29290610,XCorr,5.0067635,0.9151000,,,,1.2469999433051E-7,
MTPTKPMVVETFSEYPPLGR,hib,K,396,false,"Open search Plant PTM Viewer 2.0 - hib",164e,TBA,,,,,,,,
MTPTKPMVVETFSEYPPLGR,ub,K,396,false,"upl3 mutant / wildtype",168,35926874,"MaxQuant score",108.4500000,1.0000000,-0.1713684,0.6808200,NO,4.0244901161612E-11,0.1855600
ETFSEYPPLGR,nt,E,401,false,"Arg/N-end rule seed, prt6 vs. Wt",99,29168982,"MASCOT Score",24.3700000,,-0.4739396,0.1198027,NO,0.19679999351501,0.3551096
TFSEYPPLG,nt,T,402,false,"N-terminal ChaFRADIC",92,26010716,"MASCOT Score",35.0800000,,,,,0.049400001764297,
TFSEYPPLG,nt,T,402,false,"Arg/N-end rule seed, prt6 vs. Wt",99,29168982,"MASCOT Score",33.2600000,,-0.0687045,0.8594737,NO,0.027569999918342,-0.9699400
QTVAVGVIKSVDKK,ph,T,420,false,"Large-scale phosphorylation discovery",44,23111157,XCorr,2.4770000,,,,,,
QTVAVGVIKSVDKK,ac,K,427,false,"Quantitative Acetylproteomics",101,29440448,,,,,,,,
QTVAVGVIKSVDK,ac,K,427,false,"Histone deacetylases - apicidin vs control",98a,29061669,"MaxQuant Score",108.1000000,1.0000000,-0.1030000,0.5984116,NO,1.5000000583808E-17,
QTVAVGVIKSVDK,ac,K,427,false,"Histone deacetylases substrates - TSA vs control",98b,29061669,"MaxQuant Score",108.1000000,1.0000000,0.3100000,0.9204496,NO,1.5000000583808E-17,
QTVAVGVIKSVDK,ac,K,427,false,"Histone deacetylases- hda14 vs WT (low light)",98c,29061669,"MaxQuant Score",155.3700000,1.0000000,-0.9530000,0.9885531,NO,1.3000000365082E-7,
QTVAVGVIKSVDK,ac,K,427,false,"Histone deacetylases substrates - hda14 vs WT",98e,29061669,"MaxQuant Score",147.5000000,1.0000000,0.1060000,0.9099133,NO,2.2000000069764E-29,
QTVAVGVIKSVDK,ac,K,427,false,"Quantitative Acetylproteomics",101,29440448,,,,,,,,
QTVAVGVIK,ac,K,427,false,"Quantitative Acetylproteomics",101,29440448,,,,,,,,
QTVAVGVIKSVDKK,hib,K,427,false,"Open search Plant PTM Viewer 2.0 - hib",164e,TBA,,,,,,,,
QTVAVGVIKSVDK,ub,K,427,false,"upl3 mutant / wildtype",168,35926874,"MaxQuant score",95.9810000,1.0000000,0.2215678,0.8781800,NO,1.6960999346338E-5,-0.3180000
QTVAVGVIKSVDKK,ph,S,428,false,"Large-scale phosphorylation discovery",44,23111157,XCorr,2.4770000,,,,,,
QTVAVGVIKSVDKK,ph,S,428,false,"Tissue atlas Arabidopsis - ProteomicsDB",114,32188942,"MaxQuant score",145.2100000,1.0000000,,,,1.9733100486974E-7,
SVDKKDPTGAK,cr,K,431,false,"Open search Plant PTM Viewer 2.0 - Crotonylation",164c,TBA,,,,,,,,
SVDKKDPTGAK,cr,K,432,false,"Open search Plant PTM Viewer 2.0 - Crotonylation",164c,TBA,,,,,,,,
DPTGAKVTK,ac,K,438,false,"Quantitative Acetylproteomics",101,29440448,,,,,,,,
DPTGAKVTK,cr,K,438,false,"Open search Plant PTM Viewer 2.0 - Crotonylation",164c,TBA,,,,,,,,
DPTGAKVTKAAVK,ub,K,438,false,"TAP 6xHis-tag Ub",1,19292762,XCorr,2.2900000,,,,,,
DPTGAKVTKAAVK,ub,K,438,false,"Arabidopsis ubiquitination by TUBEs",2,23667124,,,,,,,,
VTKAAVK,ac,K,441,false,"Quantitative Acetylproteomics",101,29440448,,,,,,,,
DPTGAKVTKAAVK,ub,K,441,false,"TAP 6xHis-tag Ub",1,19292762,XCorr,2.2900000,,,,,,
DPTGAKVTKAAVK,ub,K,441,false,"Arabidopsis ubiquitination by TUBEs",2,23667124,,,,,,,,
