Peptide,PTM,ModifiedAA,ModifiedPosition,PeptideUniqueToGene,ExperimentDesc,ExpID,PubmedID,ScoreType,IdentScore,LocProb,Log2FChange,PQ-val,QuantSig,PEP,MassErrorPPM
TKNYPTVSEDYKKAVEKCRRKL,nt,T,2,true,"Arabidopsis translation initiation landscape - NT",167b,35069635,,,,,,,,
TKNYPTVSEDYKKAVEKCR,nt,T,2,true,"Arg/N-end rule pathway Roots",80,25728785,"MASCOT Score",26.9400000,,,,,0.0086610000580549,
TKNYPTVSEDYKKAVEKCR,nt,T,2,true,"FtsH12 N-terminome: WT / FtsH12 knockdown miRNA",118,33216923,"MaxQuant score",106.1700000,,,,,0.0028719999827445,
TKNYPTVSEDYKKAVEKCR,nt,T,2,true,"HUNTER N-terminome: legumain, GluC and trypsin",119,31951383,"MaxQuant score",191.0700000,,,,,,
TKNYPTVSEDYKK,nt,T,2,true,"Arg/N-end rule pathway Roots",80,25728785,"MASCOT Score",45.7500000,,,,,0.00097829999867827,
TKNYPTVSEDY,nt,T,2,true,"Arg/N-end rule seed, prt6 vs. Wt",99,29168982,"MASCOT Score",24.2100000,,-0.3262462,0.0224483,NO,0.1089999973774,-3.3759410
TKNYPTVSE,nt,T,2,true,"N-terminal ChaFRADIC",92,26010716,"MASCOT Score",35.4900000,,,,,0.11519999802113,
TKNYPTVSE,nt,T,2,true,"Arg/N-end rule seed, prt6 vs. Wt",99,29168982,"MASCOT Score",31.2100000,,0.0181430,0.8594911,NO,0.06097000092268,-2.3109745
TKNYPTVSEDYKKAVEKCRRKL,nta,T,2,true,"Arabidopsis translation initiation landscape - NTA",167a,35069635,,,,,,,,
TKNYPTVSEDYKKAVEKCR,nta,T,2,true,"HUNTER N-terminome: legumain, GluC and trypsin",119,31951383,"MaxQuant score",86.5750000,,,,,,
TKNYPTVSE,nta,T,2,true,"N-terminal ChaFRADIC",92,26010716,"MASCOT Score",35.4900000,,,,,0.11519999802113,
TKNYPTVSE,nta,T,2,true,"Arg/N-end rule seed, prt6 vs. Wt",99,29168982,"MASCOT Score",31.2100000,,-0.4762493,0.4598578,NO,0.06097000092268,-2.3109745
TKNYPTVSEDYKK,ac,K,13,true,"Quantitative Acetylproteomics",101,29440448,,,,,,,,
AVEKCR,so,C,19,true,"S-sulfenylation site detection using YAP1C",110,32714340,,,,,,,,
GLIAEKNCAPIMVR,cr,K,30,true,"Open search Plant PTM Viewer 2.0 - Crotonylation",164c,TBA,,,,,,,,
GLIAEKNCAPIMVR,hib,K,30,true,"Open search Plant PTM Viewer 2.0 - hib",164e,TBA,,,,,,,,
GLIAEKNCAPIMVR,cn,C,32,true,"Cellular regulation by S-cyanylation",115,30377236,,,,,,,,
NCAPIMVR,ox,C,32,true,"OxiTRAQ Arabidopsis - 5 mM H2O2 versus control",47,24376095,,,,0.8412914,0.0122809,YES,,
NCAPIMVR,ox,C,32,true,"SPEAR - 50 mM H2O2 / mock",138b,34619326,,,,-5.4637409,0.0153807,YES,,
NCAPIMVR,sno,C,32,true,"Endogenous S-nitrosylation in Arabidopsis",64,22115780,"MASCOT Score",31.0000000,,,,,,
NCAPIMVR,sno,C,32,true,"hot5-4 / wildtype, FAT-switch S-nitrosoproteome",169,37277371,,,,,,,,
LRGLIAEKNCAPIMVR,so,C,32,true,"S-sulfenylation site detection using YAP1C",110,32714340,,,,,,,,
NCAPIMVR,so,C,32,true,"Arabidopsis S-sulfenylation chemoproteomics",108,31578252,"pFind PSM Score",0.0694008,,1.1198200,,,,0.9807124
SAGTFDCQSR,nt,S,43,true,"Arg/N-end rule seed, prt6 vs. Wt",99,29168982,"MASCOT Score",31.7300000,,-0.3017400,0.0098624,NO,0.020800000056624,-1.5734325
LAWHSAGTFDCQSR,acy,C,49,true,"Arabidopsis S-acylation atlas - Silique",163e,35681017,,,,,,,,
LAWHSAGTFDCQSR,sno,C,49,true,"Site-specific nitrosomeproteomic id - gsnor1-3",90a,25699590,XCorr,3.6242356,,,,,0.00011010000162059,-4.6602986
LAWHSAGTFDCQSR,sno,C,49,true,"Site-specific nitrosomeproteomic id - gsnor1-3",90b,25699590,XCorr,3.7800000,,,,,2.7930000214837E-5,-7.3100000
LAWHSAGTFDCQSR,so,C,49,true,"Arabidopsis S-sulfenylation chemoproteomics",108,31578252,"pFind PSM Score",0.0004368,,1.4520200,,,,-0.8263051
LAWHSAGTFDCQSR,so,C,49,true,"S-sulfenylation site detection using YAP1C",110,32714340,,,,,,,,
TGGPFGTMR,nt,T,53,true,"N-terminal ChaFRADIC",92,26010716,"MASCOT Score",20.7000000,,,,,0.071740001440048,
TGGPFGTMR,nt,T,53,true,"Arabidopsis translation initiation landscape - NT",167b,35069635,,,,,,,,
SGIHIALR,nt,S,72,true,"N-terminal ChaFRADIC",92,26010716,"MASCOT Score",26.0800000,,,,,0.0011390000581741,
FDAEQAHGANSGIHIALR,ph,S,72,true,"Tissue atlas Arabidopsis - ProteomicsDB",114,32188942,"MaxQuant score",124.0000000,1.0000000,,,,2.5260299562247E-14,
EDKPQPPPEGR,ub,K,122,true,"Arabidopsis ubiquitination COFRADIC",40,26744219,"MaxQuant Score",59.4180000,1.0000000,,,,0.00084990001050755,0.3880000
GCDHLR,sno,C,138,true,"hot5-4 / wildtype, FAT-switch S-nitrosoproteome",169,37277371,,,,-0.3801240,0.2953765,NO,,
LPDATKGCDHLRDVFAK,so,C,138,true,"S-sulfenylation site detection using YAP1C",110,32714340,,,,,,,,
DVFAKQMGLSDKDIVALSGAHTLGR,hib,K,147,true,"Open search Plant PTM Viewer 2.0 - hib",164e,TBA,,,,,,,,
DVFAKQMGLSDKDIVALSGAHTLGR,ub,K,147,true,"upl3 mutant / wildtype",168,35926874,"MaxQuant score",128.9800000,1.0000000,-0.0262051,0.9347000,NO,6.6503501451916E-19,0.9727400
QMGLSDK,mox,M,149,true,"cat2 Methionine oxidation - 1h stress",62a,25693801,"MASCOT Score",40.0000000,,-0.0496914,,NO,,
QMGLSDK,mox,M,149,true,"cat2 Methionine oxidation - 3h stress",62b,25693801,"MASCOT Score",51.0000000,,-0.1802548,,NO,,
QMGLSDKDIVALSGAHTLGR,ac,K,154,true,"Histone deacetylases substrates - hda14 vs WT",98e,29061669,"MaxQuant Score",65.2000000,1.0000000,0.0800000,0.9162205,NO,1.9999999949505E-6,
ELLSGEKEGLLQLVSDK,cr,K,199,true,"Open search Plant PTM Viewer 2.0 - Crotonylation",164c,TBA,,,,,,,,
