Peptide,PTM,ModifiedAA,ModifiedPosition,PeptideUniqueToGene,ExperimentDesc,ExpID,PubmedID,ScoreType,IdentScore,LocProb,Log2FChange,PQ-val,QuantSig,PEP,MassErrorPPM
GKGSEDLVKK,ph,S,5,true,"Tissue atlas Arabidopsis - ProteomicsDB",114,32188942,"MaxQuant score",104.1700000,1.0000000,,,,0.00010591599857435,
GKGSEDLVK,ph,S,5,true,"atm and atr DNA damage response",88,25561503,"MASCOT Score",29.0000000,1.0000000,,,,,-2.3600000
KESLNSTPVNSDTFPAWAK,ph,S,13,true,"Tissue atlas Arabidopsis - ProteomicsDB",114,32188942,"MaxQuant score",321.4200000,1.0000000,,,,0,
ESLNSTPVNSDTFPAWAK,ph,T,17,true,"Tissue atlas Arabidopsis - ProteomicsDB",114,32188942,"MaxQuant score",153.7200000,0.8928930,,,,6.007129951377E-18,
EKGLSSDEVLKR,ac,K,53,true,"Quantitative Acetylproteomics",101,29440448,,,,,,,,
GLSSDEVLKR,ac,K,53,true,"Quantitative Acetylproteomics",101,29440448,,,,,,,,
TTKHVDENADIQGK,ac,K,216,false,"Quantitative Acetylproteomics",101,29440448,,,,,,,,
HVDENADIQGKK,ac,K,227,false,"Quantitative Acetylproteomics",101,29440448,,,,,,,,
LPSVETLGCTTVICSDK,sno,C,376,false,"hot5-4 / wildtype, FAT-switch S-nitrosoproteome",169,37277371,,,,,,,,
TGTLTTNQMAVSK,ph,T,389,false,"Tissue atlas Arabidopsis - ProteomicsDB",114,32188942,"MaxQuant score",108.3400000,0.9759890,,,,0.000125291000586,
TGTLTTNQMAVSK,ph,T,390,false,"Tissue atlas Arabidopsis - ProteomicsDB",114,32188942,"MaxQuant score",105.0800000,0.9783580,,,,0.00014917500084266,
SFNVEGTSFDPR,ph,S,410,false,"Tissue atlas Arabidopsis - ProteomicsDB",114,32188942,"MaxQuant score",85.4500000,1.0000000,,,,0.00062092597363517,
STHIQLLDGSKR,ac,K,554,true,"Quantitative Acetylproteomics",101,29440448,,,,,,,,
QAIADCR,sno,C,642,false,"hot5-4 / wildtype, FAT-switch S-nitrosoproteome",169,37277371,,,,0.3213484,0.1475088,NO,,
STAEAICR,sno,C,664,false,"hot5-4 / wildtype, FAT-switch S-nitrosoproteome",169,37277371,,,,,,,,
CTSGYR,sno,C,1043,false,"hot5-4 / wildtype, FAT-switch S-nitrosoproteome",169,37277371,,,,,,,,
