Peptide,PTM,ModifiedAA,ModifiedPosition,PeptideUniqueToGene,ExperimentDesc,ExpID,PubmedID,ScoreType,IdentScore,LocProb,Log2FChange,PQ-val,QuantSig,PEP,MassErrorPPM
MELDLTPKLPKKVYGGDGGSY,nta,M,1,true,"Arabidopsis translation initiation landscape - NTA",167a,35069635,,,,,,,,
MELDLTPK,nta,M,1,true,"Characterization plant N-terminal acetylation",6,22223895,"MASCOT Score",58.6100000,,,,,,
AWDLDENTVKK,ub,K,157,true,"upl3 mutant / wildtype",168,35926874,"MaxQuant score",72.2000000,1.0000000,0.1814206,0.8386400,NO,0.00063153600785881,-0.0142170
LVGSQTGNGIVK,ph,S,162,false,"Tissue atlas Arabidopsis - ProteomicsDB",114,32188942,"MaxQuant score",149.6900000,0.9998290,,,,6.4418702550029E-7,
AGFVLNCLEAPLDVDIKDGGR,so,C,192,true,"S-sulfenylation site detection using YAP1C",110,32714340,,,,,,,,
SLSPEVLQAAFK,ph,S,323,true,"Phospho cell culture sucrose/TOR",109,30833711,,,0.9998550,,,,,
SLSPEVLQAAFK,ph,S,323,true,"Tissue atlas Arabidopsis - ProteomicsDB",114,32188942,"MaxQuant score",161.2500000,1.0000000,,,,5.0268000872933E-10,
VAPEVEKSFR,ac,K,339,true,"Quantitative Acetylproteomics",101,29440448,,,,,,,,
VAPEVEKSFR,ub,K,339,true,"upl3 mutant / wildtype",168,35926874,"MaxQuant score",56.0430000,1.0000000,0.6229304,0.2929400,NO,0.012717899866402,1.5987000
VAPEVEKSFR,ph,S,340,true,"Tissue atlas Arabidopsis - ProteomicsDB",114,32188942,"MaxQuant score",120.9000000,1.0000000,,,,3.6144501791568E-5,
TSSAIFFPPSN,ph,S,348,true,"Phospho cell culture sucrose/TOR",109,30833711,,,0.8921270,,,,,
TSSAIFFPPSN,ph,S,348,true,"Tissue atlas Arabidopsis - ProteomicsDB",114,32188942,"MaxQuant score",179.9500000,0.9682000,,,,4.3877399001462E-13,
