Peptide,PTM,ModifiedAA,ModifiedPosition,PeptideUniqueToGene,ExperimentDesc,ExpID,PubmedID,ScoreType,IdentScore,LocProb,Log2FChange,PQ-val,QuantSig,PEP,MassErrorPPM
SGRGKGGKGL,nta,S,2,false,"Arabidopsis translation initiation landscape - NTA",167a,35069635,,,,,,,,
GKGGKGLGKGGAKR,ac,K,6,false,"Lysine acetylation gel-based Arabidopsis",36,21311030,"MASCOT Score",89.0000000,,,,,,0.2791000
GKGGKGLGKGGAKR,ac,K,6,false,"Histone deacetylases - apicidin vs control",98a,29061669,"MaxQuant Score",245.0000000,1.0000000,3.3950000,0.0001611,YES,0,
GKGGKGLGKGGAKR,ac,K,6,false,"Histone deacetylases substrates - TSA vs control",98b,29061669,"MaxQuant Score",245.0000000,1.0000000,4.9760000,0.0062517,YES,0,
GKGGKGLGKGGAKR,ac,K,6,false,"Histone deacetylases- hda14 vs WT (low light)",98c,29061669,"MaxQuant Score",227.6300000,1.0000000,-0.1360000,0.9885531,NO,1.3999999534024E-25,
GKGGKGLGKGGAKR,ac,K,6,false,"Histone deacetylases - hda14 vs WT (thylakoids)",98d,29061669,"MaxQuant Score",194.5000000,1.0000000,-0.0050000,0.9977001,NO,0,
GKGGKGLGKGGAKR,ac,K,6,false,"Histone deacetylases substrates - hda14 vs WT",98e,29061669,"MaxQuant Score",213.7000000,1.0000000,-0.0790000,0.9120108,NO,0,
GKGGKGLGKGGAKR,ac,K,6,false,"Quantitative Acetylproteomics",101,29440448,,,,,,,,
GKGGKGLGKGGAK,ac,K,6,false,"Quantitative Acetylproteomics",101,29440448,,,,,,,,
GKGGKGLGK,ac,K,6,false,"Quantitative Acetylproteomics",101,29440448,,,,,,,,
GKGGKGLGKGGAKR,ac,K,9,false,"Lysine acetylation gel-based Arabidopsis",36,21311030,"MASCOT Score",89.0000000,,,,,,0.2791000
GKGGKGLGKGGAKR,ac,K,9,false,"Histone deacetylases - apicidin vs control",98a,29061669,"MaxQuant Score",245.0000000,1.0000000,3.3950000,0.0001611,YES,0,
GKGGKGLGKGGAKR,ac,K,9,false,"Histone deacetylases substrates - TSA vs control",98b,29061669,"MaxQuant Score",245.0000000,1.0000000,4.9760000,0.0062517,YES,0,
GKGGKGLGKGGAKR,ac,K,9,false,"Histone deacetylases- hda14 vs WT (low light)",98c,29061669,"MaxQuant Score",227.6300000,1.0000000,-0.1360000,0.9885531,NO,1.3999999534024E-25,
GKGGKGLGKGGAKR,ac,K,9,false,"Histone deacetylases - hda14 vs WT (thylakoids)",98d,29061669,"MaxQuant Score",194.5000000,1.0000000,-0.0050000,0.9977001,NO,0,
GKGGKGLGKGGAKR,ac,K,9,false,"Histone deacetylases substrates - hda14 vs WT",98e,29061669,"MaxQuant Score",213.7000000,1.0000000,-0.0790000,0.9120108,NO,0,
GKGGKGLGKGGAKR,ac,K,9,false,"Quantitative Acetylproteomics",101,29440448,,,,,,,,
GKGGKGLGKGGAK,ac,K,9,false,"Quantitative Acetylproteomics",101,29440448,,,,,,,,
GGKGLGKGGAKR,ac,K,9,false,"Lysine acetylation gel-based Finkemeier et al",37,21311031,i-probability,0.9863110,,,,,,
GGKGLGKGGAKR,ac,K,9,false,"Quantitative Acetylproteomics",101,29440448,,,,,,,,
GGKGLGKGGAK,ac,K,9,false,"Lysine acetylation gel-based Finkemeier et al",37,21311031,i-probability,0.9953780,,,,,,
GGKGLGKGGAK,ac,K,9,false,"Quantitative Acetylproteomics",101,29440448,,,,,,,,
GKGGKGLGK,ac,K,9,false,"Quantitative Acetylproteomics",101,29440448,,,,,,,,
GGKGLGK,ac,K,9,false,"Quantitative Acetylproteomics",101,29440448,,,,,,,,
GKGGKGLGKGGAKR,ub,K,9,false,"Arabidopsis ubiquitination COFRADIC",40,26744219,"MaxQuant Score",99.8340000,0.9540000,,,,3.4520001008786E-6,-0.1750000
GKGGKGLGKGGAKR,ac,K,13,false,"Lysine acetylation gel-based Arabidopsis",36,21311030,"MASCOT Score",89.0000000,,,,,,0.2791000
GKGGKGLGKGGAKR,ac,K,13,false,"Histone deacetylases - apicidin vs control",98a,29061669,"MaxQuant Score",245.0000000,1.0000000,3.3950000,0.0001611,YES,0,
GKGGKGLGKGGAKR,ac,K,13,false,"Histone deacetylases substrates - TSA vs control",98b,29061669,"MaxQuant Score",245.0000000,1.0000000,4.9760000,0.0062517,YES,0,
GKGGKGLGKGGAKR,ac,K,13,false,"Histone deacetylases- hda14 vs WT (low light)",98c,29061669,"MaxQuant Score",227.6300000,1.0000000,-0.1360000,0.9885531,NO,1.3999999534024E-25,
GKGGKGLGKGGAKR,ac,K,13,false,"Histone deacetylases - hda14 vs WT (thylakoids)",98d,29061669,"MaxQuant Score",194.5000000,1.0000000,-0.0050000,0.9977001,NO,0,
GKGGKGLGKGGAKR,ac,K,13,false,"Histone deacetylases substrates - hda14 vs WT",98e,29061669,"MaxQuant Score",213.7000000,1.0000000,-0.0790000,0.9120108,NO,0,
GKGGKGLGKGGAKR,ac,K,13,false,"Quantitative Acetylproteomics",101,29440448,,,,,,,,
GKGGKGLGKGGAK,ac,K,13,false,"Quantitative Acetylproteomics",101,29440448,,,,,,,,
GGKGLGKGGAKR,ac,K,13,false,"Lysine acetylation gel-based Finkemeier et al",37,21311031,i-probability,0.9863110,,,,,,
GGKGLGKGGAKR,ac,K,13,false,"Quantitative Acetylproteomics",101,29440448,,,,,,,,
GGKGLGKGGAK,ac,K,13,false,"Lysine acetylation gel-based Finkemeier et al",37,21311031,i-probability,0.9953780,,,,,,
GGKGLGKGGAK,ac,K,13,false,"Quantitative Acetylproteomics",101,29440448,,,,,,,,
GLGKGGAKR,ac,K,13,false,"Lysine acetylation gel-based Finkemeier et al",37,21311031,i-probability,0.9999940,,,,,,
GLGKGGAKR,ac,K,13,false,"Histone deacetylases - apicidin vs control",98a,29061669,"MaxQuant Score",245.0000000,1.0000000,2.7550000,0.0016106,YES,0,
GLGKGGAKR,ac,K,13,false,"Histone deacetylases substrates - TSA vs control",98b,29061669,"MaxQuant Score",245.0000000,1.0000000,3.8020000,0.0666807,NO,0,
GLGKGGAKR,ac,K,13,false,"Histone deacetylases- hda14 vs WT (low light)",98c,29061669,"MaxQuant Score",227.6300000,1.0000000,-0.4210000,0.9885531,NO,1.3999999534024E-25,
GLGKGGAKR,ac,K,13,false,"Histone deacetylases - hda14 vs WT (thylakoids)",98d,29061669,"MaxQuant Score",194.5000000,1.0000000,-0.0510000,0.9954054,NO,0,
GLGKGGAKR,ac,K,13,false,"Histone deacetylases substrates - hda14 vs WT",98e,29061669,"MaxQuant Score",219.5000000,1.0000000,-0.0580000,0.9162205,NO,0,
GLGKGGAKR,ac,K,13,false,"Quantitative Acetylproteomics",101,29440448,,,,,,,,
GLGKGGAK,ac,K,13,false,"Quantitative Acetylproteomics",101,29440448,,,,,,,,
GLGKGGAK,hib,K,13,false,"Histone Khib and acetylation, dark-induced starvat",137,34165567,,,1.0000000,,,,,
GKGGKGLGKGGAKR,ub,K,13,false,"Arabidopsis ubiquitination COFRADIC",40,26744219,"MaxQuant Score",53.3000000,0.9860000,,,,0.0040000001899898,-0.2050000
GKGGKGLGKGGAKR,ac,K,17,false,"Lysine acetylation gel-based Arabidopsis",36,21311030,"MASCOT Score",89.0000000,,,,,,0.2791000
GKGGKGLGKGGAKR,ac,K,17,false,"Histone deacetylases - apicidin vs control",98a,29061669,"MaxQuant Score",245.0000000,1.0000000,3.3950000,0.0001611,YES,0,
GKGGKGLGKGGAKR,ac,K,17,false,"Histone deacetylases substrates - TSA vs control",98b,29061669,"MaxQuant Score",245.0000000,1.0000000,4.9760000,0.0062517,YES,0,
GKGGKGLGKGGAKR,ac,K,17,false,"Histone deacetylases- hda14 vs WT (low light)",98c,29061669,"MaxQuant Score",227.6300000,1.0000000,-0.1360000,0.9885531,NO,1.3999999534024E-25,
GKGGKGLGKGGAKR,ac,K,17,false,"Histone deacetylases - hda14 vs WT (thylakoids)",98d,29061669,"MaxQuant Score",194.5000000,1.0000000,-0.0050000,0.9977001,NO,0,
GKGGKGLGKGGAKR,ac,K,17,false,"Histone deacetylases substrates - hda14 vs WT",98e,29061669,"MaxQuant Score",213.7000000,1.0000000,-0.0790000,0.9120108,NO,0,
GKGGKGLGKGGAKR,ac,K,17,false,"Quantitative Acetylproteomics",101,29440448,,,,,,,,
GKGGKGLGKGGAK,ac,K,17,false,"Quantitative Acetylproteomics",101,29440448,,,,,,,,
GGKGLGKGGAKR,ac,K,17,false,"Lysine acetylation gel-based Finkemeier et al",37,21311031,i-probability,0.9863110,,,,,,
GGKGLGKGGAKR,ac,K,17,false,"Quantitative Acetylproteomics",101,29440448,,,,,,,,
GLGKGGAKR,ac,K,17,false,"Lysine acetylation gel-based Finkemeier et al",37,21311031,i-probability,0.9999940,,,,,,
GLGKGGAKR,ac,K,17,false,"Histone deacetylases - apicidin vs control",98a,29061669,"MaxQuant Score",245.0000000,1.0000000,2.7550000,0.0016106,YES,0,
GLGKGGAKR,ac,K,17,false,"Histone deacetylases substrates - TSA vs control",98b,29061669,"MaxQuant Score",245.0000000,1.0000000,3.8020000,0.0666807,NO,0,
GLGKGGAKR,ac,K,17,false,"Histone deacetylases- hda14 vs WT (low light)",98c,29061669,"MaxQuant Score",227.6300000,1.0000000,-0.4210000,0.9885531,NO,1.3999999534024E-25,
GLGKGGAKR,ac,K,17,false,"Histone deacetylases - hda14 vs WT (thylakoids)",98d,29061669,"MaxQuant Score",194.5000000,1.0000000,-0.0510000,0.9954054,NO,0,
GLGKGGAKR,ac,K,17,false,"Histone deacetylases substrates - hda14 vs WT",98e,29061669,"MaxQuant Score",219.5000000,1.0000000,-0.0580000,0.9162205,NO,0,
GLGKGGAKR,ac,K,17,false,"Quantitative Acetylproteomics",101,29440448,,,,,,,,
GLGKGGAK,ac,K,17,false,"Quantitative Acetylproteomics",101,29440448,,,,,,,,
DNIQGITKPAIR,ac,K,32,false,"Histone deacetylases substrates - TSA vs control",98b,29061669,"MaxQuant Score",63.2000000,1.0000000,-0.2540000,0.9772372,NO,0.0060000000521541,
DNIQGITKPAIR,ac,K,32,false,"Histone deacetylases- hda14 vs WT (low light)",98c,29061669,"MaxQuant Score",74.7300000,1.0000000,0.1930000,0.9885531,NO,0.041999999433756,
DNIQGITKPAIR,ac,K,32,false,"Histone deacetylases substrates - hda14 vs WT",98e,29061669,"MaxQuant Score",107.7000000,1.0000000,-0.0760000,0.9120108,NO,1.4999999940063E-12,
DNIQGITKPAIR,hib,K,32,false,"Histone Khib and acetylation, dark-induced starvat",137,34165567,,,1.0000000,,,,,
DNIQGITKPAIR,ub,K,32,false,"Arabidopsis ubiquitination COFRADIC",40,26744219,"MaxQuant Score",152.9600000,1.0000000,,,,3.0870000797503E-21,0.6100000
DNIQGITKPAIR,ub,K,32,false,"upl3 mutant / wildtype",168,35926874,"MaxQuant score",71.1760000,1.0000000,-0.1408255,0.8796400,NO,0.00034543100628071,0.6659100
GVLKIFLENVIR,hib,K,60,false,"Histone Khib and acetylation, dark-induced starvat",137,34165567,,,1.0000000,,,,,
RKTVTAMDVVYALK,hib,K,80,false,"Histone Khib and acetylation, dark-induced starvat",137,34165567,,,1.0000000,,,,,
KTVTAMDVVYALKR,ac,K,92,false,"Quantitative Acetylproteomics",101,29440448,,,,,,,,
TVTAMDVVYALKR,ac,K,92,false,"Histone deacetylases - apicidin vs control",98a,29061669,"MaxQuant Score",124.6000000,1.0000000,-0.0490000,0.7516229,NO,4.3000000261861E-12,
TVTAMDVVYALKR,ac,K,92,false,"Histone deacetylases- hda14 vs WT (low light)",98c,29061669,"MaxQuant Score",155.9900000,1.0000000,0.3700000,0.9885531,NO,2.7000000013544E-9,
TVTAMDVVYALKR,ac,K,92,false,"Histone deacetylases - hda14 vs WT (thylakoids)",98d,29061669,"MaxQuant Score",97.7000000,1.0000000,0.5280000,0.8394600,NO,9.4799997896189E-6,
TVTAMDVVYALKR,hib,K,92,false,"Histone Khib and acetylation, dark-induced starvat",137,34165567,,,1.0000000,,,,,
TLYGFGG,nt,T,97,false,"N-terminal ChaFRADIC",92,26010716,"MASCOT Score",31.1300000,,,,,0.10859999805689,
