Peptide,PTM,ModifiedAA,ModifiedPosition,PeptideUniqueToGene,ExperimentDesc,ExpID,PubmedID,ScoreType,IdentScore,LocProb,Log2FChange,PQ-val,QuantSig,PEP,MassErrorPPM
GFESNITCDCSFLPQNSSCHVIR,ng,N,76,true,"Conserved N-glycosylation",74,22633491,"MaxQuant Score",223.3200000,1.0000000,,,,0,0.8780000
GFESNITCDCSFLPQNSSCHVIR,ng,N,87,true,"Conserved N-glycosylation",74,22633491,"MaxQuant Score",223.3200000,1.0000000,,,,0,0.8780000
SQNLTGIVPPEFSK,ng,N,101,true,"Conserved N-glycosylation",74,22633491,"MaxQuant Score",126.1700000,1.0000000,,,,1.4869999491723E-13,-0.1170000
SQNLTGIVPPEFSK,ng,N,101,true,"UDP-GlcNAc transporter glycopeptide analysis",135,30224661,,,,,,,1.219309619634E-13,0.7000000
ISDNNFTGPIPDFISNWTR,ng,N,231,true,"Conserved N-glycosylation",74,22633491,"MaxQuant Score",71.1200000,1.0000000,,,,0.020999999716878,-0.9930000
LKTLDLSFNLLSGEIPSSFENMK,ph,S,318,true,"STN8 phosphoproteome",38,21768351,"MASCOT Score",48.2400000,,,,,,
NVDVSFNNFTDESSIPSHDCNR,ng,N,362,true,"Conserved N-glycosylation",74,22633491,"MaxQuant Score",214.3500000,0.8980000,,,,0,0.1250000
VTSNLVESFALGNK,ng,N,389,true,"Conserved N-glycosylation",74,22633491,"MaxQuant Score",140.1300000,1.0000000,,,,7.9650003126904E-20,0.0420000
VTSNLVESFALGNK,ng,N,389,true,"UDP-GlcNAc transporter glycopeptide analysis",135,30224661,,,,,,,2.4897437085093E-13,0.5000000
WALSSTGNFMDNDDDADEYTVQNTSR,ng,N,474,true,"Conserved N-glycosylation",74,22633491,"MaxQuant Score",76.7170000,1.0000000,,,,0.093000002205372,-0.1930000
LSVNASSPSFGLYR,ng,N,481,true,"Conserved N-glycosylation",74,22633491,"MaxQuant Score",140.3300000,1.0000000,,,,7.658999708478E-20,0.1750000
LSVNASSPSFGLYR,ng,N,481,true,"N-linked Glycan Micro-heterogeneity Arabidopsis",134,29237727,,,,,,,,
LSVNASSPSFGLYR,ng,N,481,true,"UDP-GlcNAc transporter glycopeptide analysis",135,30224661,,,,,,,3.6637666099744E-13,0.6000000
SFLVNVTDHTLK,ng,N,570,true,"Conserved N-glycosylation",74,22633491,"MaxQuant Score",90.4220000,1.0000000,,,,0.00024769999436103,-0.4550000
SFLVNVTDHTLK,ng,N,570,true,"N-linked Glycan Micro-heterogeneity Arabidopsis",134,29237727,,,,,,,,
SFLVNVTDHTLK,ng,N,570,true,"UDP-GlcNAc transporter glycopeptide analysis",135,30224661,,,,,,,3.344595650781E-12,0.1000000
LNDDGNTHISTR,ph,S,838,true,"STN8 phosphoproteome",38,21768351,"MASCOT Score",64.2100000,,,,,,-1.3840800
LNDDGNTHISTR,ph,S,838,true,"atm and atr DNA damage response",88,25561503,"MASCOT Score",45.0000000,0.9540000,,,,,0.1600000
LNDDGNTHISTR,ph,S,838,true,"TOR Kinase and ABA Receptor",100,29290610,XCorr,3.0320852,0.9419000,,,,0.033009998500347,
LNDDGNTHISTR,ph,S,838,true,"Tissue atlas Arabidopsis - ProteomicsDB",114,32188942,"MaxQuant score",177.9300000,0.9801690,,,,1.4405099628488E-19,
NHFWQNELSR,ph,S,985,true,"Tissue atlas Arabidopsis - ProteomicsDB",114,32188942,"MaxQuant score",67.6560000,1.0000000,,,,0.0078399302437901,
SLSFSTSGPR,ph,S,989,true,"STN8 phosphoproteome",38,21768351,"MASCOT Score",47.3800000,,,,,,-1.5572900
SLSFSTSGPR,ph,S,989,true,"Phosphoproteome ethylene-regulated time response",46,24043427,"MASCOT Score",31.8300000,,,,,,6.6514000
SLSFSTSGPR,ph,S,989,true,"Chloroplast kinase substrates",60,19376835,"MASCOT Score",50.6800000,,,,,,-1.5572900
SLSFSTSGPR,ph,S,989,true,"srk2dei ABA signaling phopshoproteomics",83,23572148,"MASCOT Score",47.0000000,,,,,,0.0005000
SLSFSTSGPR,ph,S,989,true,"LAXIC - ABA stress",84a,23660473,XCorr,2.9800000,0.9890000,,,,0.051023099571466,
SLSFSTSGPR,ph,S,989,true,"atm and atr DNA damage response",88,25561503,"MASCOT Score",42.0000000,0.9300000,,,,,-0.0900000
SLSFSTSGPR,ph,S,989,true,"TOR Kinase and ABA Receptor",100,29290610,XCorr,2.8831210,0.8812000,,,,0.00087280001025647,
SLSFSTSGPR,ph,S,989,true,"Tissue atlas Arabidopsis - ProteomicsDB",114,32188942,"MaxQuant score",163.8400000,0.9999920,,,,4.0252399458041E-7,
SLSFSTSGPR,ph,S,989,true,"Touch-induced phosphorylation: 40s touch vs untouc",136,30291188,"MASCOT score",42.3700000,,0.1642938,0.0245861,NO,,7.6030779
SLSFSTSGPR,ph,S,991,true,"atm and atr DNA damage response",88,25561503,"MASCOT Score",37.0000000,0.9930000,,,,,0.6200000
SLSFSTSGPR,ph,T,992,true,"Tissue atlas Arabidopsis - ProteomicsDB",114,32188942,"MaxQuant score",87.2160000,0.8414660,,,,0.01027899980545,
SLSFSTSGPR,ph,S,993,true,"Tissue atlas Arabidopsis - ProteomicsDB",114,32188942,"MaxQuant score",80.8150000,0.8235960,,,,0.0022833400871605,
TASANSLVDAEEK,ph,S,999,true,"LAXIC - ABA stress",84a,23660473,XCorr,3.3300000,0.9560000,,,,4.3000000005122E-7,
TASANSLVDAEEK,ph,S,999,true,"LAXIC - mannitol vs control",84b,23660473,XCorr,3.6600000,0.9230000,,,,7.7800001463402E-7,
TASANSLVDAEEK,ph,S,999,true,"atm and atr DNA damage response",88,25561503,"MASCOT Score",77.0000000,1.0000000,,,,,-0.1000000
TASANSLVDAEEK,ph,S,999,true,"TOR Kinase and ABA Receptor",100,29290610,XCorr,3.9284341,0.9072000,,,,7.4629999289755E-5,
TASANSLVDAEEK,ph,S,999,true,"Tissue atlas Arabidopsis - ProteomicsDB",114,32188942,"MaxQuant score",186.5600000,0.9999530,,,,2.4611500988035E-22,
TASANSLVDAEEK,ph,S,1002,true,"LAXIC - ABA stress",84a,23660473,XCorr,2.6600000,1.0000000,,,,0.0011204299516976,
TASANSLVDAEEK,ph,S,1002,true,"LAXIC - mannitol vs control",84b,23660473,XCorr,3.6600000,1.0000000,,,,7.7800001463402E-7,
TASANSLVDAEEK,ph,S,1002,true,"atm and atr DNA damage response",88,25561503,"MASCOT Score",72.0000000,1.0000000,,,,,-0.5900000
TASANSLVDAEEK,ph,S,1002,true,"TOR Kinase and ABA Receptor",100,29290610,XCorr,3.9284341,1.0000000,,,,7.4629999289755E-5,
TASANSLVDAEEK,ph,S,1002,true,"Tissue atlas Arabidopsis - ProteomicsDB",114,32188942,"MaxQuant score",201.7000000,1.0000000,,,,1.2285000066637E-38,
TASANSLVDAEEKTGLLD,ph,T,1010,true,"Tissue atlas Arabidopsis - ProteomicsDB",114,32188942,"MaxQuant score",242.1000000,1.0000000,,,,0,
