Peptide,PTM,ModifiedAA,ModifiedPosition,PeptideUniqueToGene,ExperimentDesc,ExpID,PubmedID,ScoreType,IdentScore,LocProb,Log2FChange,PQ-val,QuantSig,PEP,MassErrorPPM
ESNPLNVSDPNSKK,ng,N,77,true,"Conserved N-glycosylation",74,22633491,"MaxQuant Score",96.3650000,0.9990000,,,,7.8620003478136E-5,2.0300000
ESNPLNVSDPNSKK,ng,N,77,true,"UDP-GlcNAc transporter glycopeptide analysis",135,30224661,,,,,,,4.5240253210288E-10,0.1000000
ESNPLNVSDPNSK,ng,N,77,true,"UDP-GlcNAc transporter glycopeptide analysis",135,30224661,,,,,,,1.4679481864732E-5,0.4000000
EQIFGSNDTSGDPK,ng,N,114,true,"Conserved N-glycosylation",74,22633491,"MaxQuant Score",95.5280000,1.0000000,,,,9.3829999968875E-5,0.0060000
EQIFGSNDTSGDPK,ng,N,114,true,"UDP-GlcNAc transporter glycopeptide analysis",135,30224661,,,,,,,5.8297297073295E-5,0.5000000
WFASVPTSTQPNR,ph,T,171,true,"Tissue atlas Arabidopsis - ProteomicsDB",114,32188942,"MaxQuant score",150.6900000,0.7909470,,,,1.3736499795414E-6,
WFASVPTSTQPNR,ph,S,172,true,"Tissue atlas Arabidopsis - ProteomicsDB",114,32188942,"MaxQuant score",173.7200000,0.8949760,,,,2.5519599217291E-15,
WFASVPTSTQPNR,ph,T,173,true,"Tissue atlas Arabidopsis - ProteomicsDB",114,32188942,"MaxQuant score",194.8600000,0.9342080,,,,5.263929906824E-30,
LPNYSVVEQR,ng,N,259,true,"Conserved N-glycosylation",74,22633491,"MaxQuant Score",99.2570000,1.0000000,,,,0.00052689999574795,0.8290000
NMTVSEGNK,ng,N,475,true,"Conserved N-glycosylation",74,22633491,"MaxQuant Score",66.9850000,1.0000000,,,,0.020999999716878,2.8330000
