Peptide,PTM,ModifiedAA,ModifiedPosition,PeptideUniqueToGene,ExperimentDesc,ExpID,PubmedID,ScoreType,IdentScore,LocProb,Log2FChange,PQ-val,QuantSig,PEP,MassErrorPPM
ATNEPEHEHRDEEEAGANEDEDTGAQVAPIVR,nt,A,2,true,"Stromal N-terminome",96,26371235,"MASCOT Score",41.9700000,,,,,,
ATNEPEHEHRDEEEAGANEDEDTGAQVAPIVR,nt,A,2,true,"HUNTER N-terminome: legumain, GluC and trypsin",119,31951383,"MaxQuant score",94.1550000,,,,,,
ATNEPEHEHR,nt,A,2,true,"Arg/N-end rule seed, prt6 vs. Wt",99,29168982,"MASCOT Score",55.7300000,,0.1659695,0.5554211,NO,0.015069999732077,-1.3028559
ATNEPEHEHRDEEEAGANEDEDTGAQVAPIVR,nta,A,2,true,"Arg/N-end rule pathway Roots",80,25728785,"MASCOT Score",84.8000000,,,,,2.2610000538492E-9,
ATNEPEHEHRDEEEAGANEDEDTGAQVAPIVR,nta,A,2,true,"Stromal N-terminome",96,26371235,"MASCOT Score",41.9700000,,,,,,
ATNEPEHEHRDEEEAGANEDEDTGAQVAPIVR,nta,A,2,true,"HUNTER N-terminome: legumain, GluC and trypsin",119,31951383,"MaxQuant score",294.6000000,,,,,,
ATNEPEHEHR,nta,A,2,true,"Arg/N-end rule pathway Roots",80,25728785,"MASCOT Score",28.5900000,,,,,0.05570999905467,
ATNEPEHEHR,nta,A,2,true,"Arg/N-end rule seed, prt6 vs. Wt",99,29168982,"MASCOT Score",55.7300000,,,,,0.015069999732077,-1.3028559
FDKDANQWK,ub,K,61,true,"upl3 mutant / wildtype",168,35926874,"MaxQuant score",56.4320000,1.0000000,,,,0.0065569197759032,-0.5913300
GAGTVKFLK,ac,K,75,false,"Histone deacetylases - apicidin vs control",98a,29061669,"MaxQuant Score",56.9000000,1.0000000,0.4230000,0.1857804,NO,0.012000000104308,
GAGTVKFLK,ac,K,75,false,"Quantitative Acetylproteomics",101,29440448,,,,,,,,
ICANHFVK,so,C,98,true,"Arabidopsis S-sulfenylation chemoproteomics",108,31578252,"pFind PSM Score",0.0010161,,2.9537500,,,,1.1047600
ICANHFVK,so,C,98,true,"S-sulfenylation site detection using YAP1C",110,32714340,,,,,,,,
SGMSVQEHVGNEK,mox,M,107,true,"cat2 Methionine oxidation - 1h stress",62a,25693801,"MASCOT Score",78.0000000,,0.2353130,,NO,,
SGMSVQEHVGNEK,mox,M,107,true,"cat2 Methionine oxidation - 3h stress",62b,25693801,"MASCOT Score",45.0000000,,-0.0893987,,NO,,
SCVWHAR,so,C,119,false,"Arabidopsis S-sulfenylation chemoproteomics",108,31578252,"pFind PSM Score",0.0530024,,2.1233700,,,,0.9016588
SCVWHAR,so,C,119,false,"S-sulfenylation site detection using YAP1C",110,32714340,,,,,,,,
DFADGELKDELFCIR,ox,C,137,true,"SPEAR - 10 mM H2O2 / mock",138a,34619326,,,,1.6594206,0.0265898,YES,,
DFADGELKDELFCIR,sno,C,137,true,"hot5-4 / wildtype, FAT-switch S-nitrosoproteome",169,37277371,,,,0.9900452,0.0066232,YES,,
DELFCIR,sno,C,137,false,"hot5-4 / wildtype, FAT-switch S-nitrosoproteome",169,37277371,,,,,,,,
DELFCIR,so,C,137,false,"Arabidopsis S-sulfenylation chemoproteomics",108,31578252,"pFind PSM Score",0.2084720,,,,,,-1.3779312
FASIENCK,ox,C,146,false,"OxiTRAQ Arabidopsis - 5 mM H2O2 versus control",47,24376095,,,,-0.0701871,0.7754556,NO,,
FASIENCK,sno,C,146,false,"hot5-4 / wildtype, FAT-switch S-nitrosoproteome",169,37277371,,,,0.6112526,0.0000129,YES,,
FASIENCK,so,C,146,false,"Arabidopsis S-sulfenylation chemoproteomics",108,31578252,"pFind PSM Score",0.0100527,,2.3614800,,,,1.2064125
FASIENCK,so,C,146,false,"S-sulfenylation site detection using YAP1C",110,32714340,,,,,,,,
FASIENCKTFMQK,ub,K,147,true,"upl3 mutant / wildtype",168,35926874,"MaxQuant score",169.8900000,1.0000000,0.5811102,0.4917200,NO,1.5853500098219E-16,-0.0801400
TFMQKFK,ac,K,152,true,"Quantitative Acetylproteomics",101,29440448,,,,,,,,
EVAESEEEKEESKDAADTAGLLEK,ph,S,159,true,"Large-scale phosphorylation discovery",44,23111157,XCorr,2.9740000,,,,,,
FKEVAESEEEKEESK,ph,S,159,false,"Phospho cell culture sucrose/TOR",109,30833711,,,1.0000000,,,,,
FKEVAESEEEKEESK,ph,S,159,false,"Tissue atlas Arabidopsis - ProteomicsDB",114,32188942,"MaxQuant score",144.8200000,0.9999990,,,,7.5702502000302E-35,
EVAESEEEKEESKDAADTAGLLEK,ph,S,166,true,"Tissue atlas Arabidopsis - ProteomicsDB",114,32188942,"MaxQuant score",82.5930000,0.9905970,,,,7.3620198826063E-10,
DAADTAGLLEK,ph,T,172,true,"Tissue atlas Arabidopsis - ProteomicsDB",114,32188942,"MaxQuant score",130.1000000,1.0000000,,,,1.286459973926E-5,
LTVEETKTEEK,ph,T,184,true,"Tissue atlas Arabidopsis - ProteomicsDB",114,32188942,"MaxQuant score",144.1600000,0.9737800,,,,2.2799200394275E-7,
LTVEETKTEEKTEAK,ph,T,190,true,"Tissue atlas Arabidopsis - ProteomicsDB",114,32188942,"MaxQuant score",50.8830000,0.8389960,,,,0.0038543299306184,
AVETAKTEVK,ph,T,197,true,"Tissue atlas Arabidopsis - ProteomicsDB",114,32188942,"MaxQuant score",140.9100000,0.9999860,,,,2.0296500224504E-5,
AVETAKTEVK,ph,T,200,true,"Tissue atlas Arabidopsis - ProteomicsDB",114,32188942,"MaxQuant score",178.8400000,1.0000000,,,,7.3318200399797E-9,
ESEAEKSGEAK,ph,S,215,true,"atm and atr DNA damage response",88,25561503,"MASCOT Score",25.0000000,1.0000000,,,,,-2.0800000
