Peptide,PTM,ModifiedAA,ModifiedPosition,PeptideUniqueToGene,ExperimentDesc,ExpID,PubmedID,ScoreType,IdentScore,LocProb,Log2FChange,PQ-val,QuantSig,PEP,MassErrorPPM
GSGASK,myr,G,2,false,"Characterization plant N-terminal acetylation",6,22223895,"MASCOT Score",32.1800000,,,,,,
NTEEDDDGSNGGGGQLYVSLK,ph,T,9,true,"srk2dei ABA signaling phopshoproteomics",83,23572148,"MASCOT Score",28.0000000,,,,,,0.0011000
NTEEDDDGSNGGGGQLYVSLK,ph,S,16,true,"Tyrosine phosphorylation in Arabidopsis",59,18463617,"MASCOT Score",98.0000000,,,,,,-0.9848253
NTEEDDDGSNGGGGQLYVSLK,ph,S,16,true,"srk2dei ABA signaling phopshoproteomics",83,23572148,"MASCOT Score",94.0000000,,,,,,-0.0011000
NTEEDDDGSNGGGGQLYVSLK,ph,S,16,true,"LAXIC - ABA stress",84a,23660473,XCorr,3.5700000,0.9980000,,,,0.013416799716651,
NTEEDDDGSNGGGGQLYVSLK,ph,S,16,true,"SnRK2 protein kinase substrates",85,23776212,XCorr,5.3289719,1.0000000,,,,5.7468101388736E-9,
NTEEDDDGSNGGGGQLYVSLK,ph,S,16,true,"atm and atr DNA damage response",88,25561503,"MASCOT Score",28.0000000,1.0000000,,,,,-0.1300000
NTEEDDDGSNGGGGQLYVSLK,ph,S,16,true,"Phospho cell culture sucrose/TOR",109,30833711,,,0.9999990,,,,,
NTEEDDDGSNGGGGQLYVSLK,ph,S,16,true,"Tissue atlas Arabidopsis - ProteomicsDB",114,32188942,"MaxQuant score",247.5500000,1.0000000,,,,0,
NTPCIVEEGENR,sno,C,96,true,"Site-specific nitrosomeproteomic id - gsnor1-3",90a,25699590,XCorr,2.9794440,,,,,0.0010280000278726,-7.4176541
NTPCIVEEGENR,so,C,96,true,"S-sulfenylation site detection using YAP1C",110,32714340,,,,,,,,
GIPDVSINPDPK,ph,S,167,false,"Tissue atlas Arabidopsis - ProteomicsDB",114,32188942,"MaxQuant score",77.8940000,1.0000000,,,,0.0018574199639261,
SLSASGSFRNDSTPK,ph,S,214,true,"srk2dei ABA signaling phopshoproteomics",83,23572148,"MASCOT Score",26.0000000,,,,,,0.0005000
SLSASGSFRNDSTPK,ph,S,216,true,"Conserved plant phosphoproteome - Arabidopsis",61a,20466843,"MASCOT Score",25.0000000,1.0000000,,,,,
SLSASGSFR,ph,S,216,true,"STN8 phosphoproteome",38,21768351,"MASCOT Score",45.4300000,,,,,,0.3099630
SLSASGSFR,ph,S,216,true,"Chloroplast kinase substrates",60,19376835,"MASCOT Score",42.1400000,,,,,,-0.5565950
SLSASGSFR,ph,S,216,true,"srk2dei ABA signaling phopshoproteomics",83,23572148,"MASCOT Score",51.0000000,,,,,,0.0005000
SLSASGSFR,ph,S,216,true,"LAXIC - mannitol vs control",84b,23660473,XCorr,2.4900000,0.8890000,,,,0.021959699690342,
SLSASGSFR,ph,S,216,true,"atm and atr DNA damage response",88,25561503,"MASCOT Score",47.0000000,0.9180000,,,,,0.2000000
SLSASGSFR,ph,S,216,true,"Tissue atlas Arabidopsis - ProteomicsDB",114,32188942,"MaxQuant score",175.6400000,0.9999980,,,,2.0249899534974E-5,
SLSASGSFRNDSTPK,ph,S,218,true,"Chloroplast kinase substrates",60,19376835,"MASCOT Score",40.1300000,,,,,,-1.0205900
SLSASGSFRNDSTPK,ph,S,218,true,"srk2dei ABA signaling phopshoproteomics",83,23572148,"MASCOT Score",52.0000000,,,,,,-0.0010000
SLSASGSFRNDSTPK,ph,S,218,true,"SnRK2 protein kinase substrates",85,23776212,XCorr,2.7474349,0.7520000,,,,0.003833289956674,
SLSASGSFRNDSTPK,ph,S,218,true,"TOR Kinase and ABA Receptor",100,29290610,XCorr,3.1348233,0.8545000,,,,0.023639999330044,
SLSASGSFRNDSTPK,ph,S,218,true,"Tissue atlas Arabidopsis - ProteomicsDB",114,32188942,"MaxQuant score",188.0000000,0.9580780,,,,1.581709995356E-25,
SLSASGSFR,ph,S,218,true,"Tyrosine phosphorylation in Arabidopsis",59,18463617,"MASCOT Score",40.0000000,,,,,,-0.8077412
SLSASGSFR,ph,S,218,true,"srk2dei ABA signaling phopshoproteomics",83,23572148,"MASCOT Score",46.0000000,,,,,,-0.0006000
SLSASGSFRNDSTPK,ph,S,220,true,"Arabidopsis root NAA phosphoproteome",18a,27643528,"MaxQuant Score",61.0960000,0.7530000,,,,5.3039999329485E-5,0.0820000
SLSASGSFRNDSTPK,ph,S,220,true,"STN8 phosphoproteome",38,21768351,"MASCOT Score",50.0400000,,,,,,-1.1429300
SLSASGSFRNDSTPK,ph,S,220,true,"Phosphoproteome ethylene-regulated time response",46,24043427,"MASCOT Score",53.8100000,,,,,,-0.8132300
SLSASGSFRNDSTPK,ph,S,220,true,"Chloroplast kinase substrates",60,19376835,"MASCOT Score",45.6300000,,,,,,-1.3753900
SLSASGSFRNDSTPK,ph,S,220,true,"srk2dei ABA signaling phopshoproteomics",83,23572148,"MASCOT Score",68.0000000,,,,,,-0.0009000
SLSASGSFRNDSTPK,ph,S,220,true,"atm and atr DNA damage response",88,25561503,"MASCOT Score",37.0000000,0.9040000,,,,,-0.2300000
SLSASGSFRNDSTPK,ph,S,220,true,"Protein sumoylation and phosphorylation cross-talk",97,28419593,,,,,,,,
SLSASGSFRNDSTPK,ph,S,220,true,"TOR Kinase and ABA Receptor",100,29290610,XCorr,3.2656233,0.9765000,,,,0.00027590000536293,
SLSASGSFR,ph,S,220,true,"STN8 phosphoproteome",38,21768351,"MASCOT Score",49.4700000,,,,,,0.6122510
SLSASGSFR,ph,S,220,true,"Tyrosine phosphorylation in Arabidopsis",59,18463617,"MASCOT Score",44.0000000,,,,,,-0.5048380
SLSASGSFR,ph,S,220,true,"Chloroplast kinase substrates",60,19376835,"MASCOT Score",43.3200000,,,,,,0.4107260
SLSASGSFR,ph,S,220,true,"srk2dei ABA signaling phopshoproteomics",83,23572148,"MASCOT Score",52.0000000,,,,,,0.0001000
SLSASGSFR,ph,S,220,true,"LAXIC - mannitol vs control",84b,23660473,XCorr,2.4900000,0.8890000,,,,0.021959699690342,
SLSASGSFR,ph,S,220,true,"SnRK2 protein kinase substrates",85,23776212,XCorr,2.0252950,0.9910000,,,,0.085795097053051,
SLSASGSFR,ph,S,220,true,"atm and atr DNA damage response",88,25561503,"MASCOT Score",51.0000000,0.9930000,,,,,0.9500000
SLSASGSFR,ph,S,220,true,"TOR Kinase and ABA Receptor",100,29290610,XCorr,2.8490660,0.9918000,,,,0.0076939999125898,
SLSASGSFR,ph,S,220,true,"Lateral root-induction - NAA vs control",106,23328941,"MASCOT Score",22.0000000,,,,,,
SLSASGSFR,ph,S,220,true,"Phospho cell culture sucrose/TOR",109,30833711,,,0.9924210,,,,,
SLSASGSFR,ph,S,220,true,"Tissue atlas Arabidopsis - ProteomicsDB",114,32188942,"MaxQuant score",209.9000000,0.9999900,,,,2.8025969286496E-45,
SLSASGSFRNDSTPK,ph,S,225,true,"srk2dei ABA signaling phopshoproteomics",83,23572148,"MASCOT Score",55.0000000,,,,,,0.0001000
SLSASGSFRNDSTPK,ph,T,226,true,"srk2dei ABA signaling phopshoproteomics",83,23572148,"MASCOT Score",26.0000000,,,,,,-0.0011000
SLSASGSFRNDSTPK,ph,T,226,true,"Tissue atlas Arabidopsis - ProteomicsDB",114,32188942,"MaxQuant score",154.0100000,0.9962900,,,,3.50107001168E-8,
AAQRNSEDSGVTVDGSPSAK,ph,S,234,false,"atm and atr DNA damage response",88,25561503,"MASCOT Score",45.0000000,1.0000000,,,,,-0.2200000
NSEDSGVTVDGSPSAK,ph,S,234,false,"Chloroplast kinase substrates",60,19376835,"MASCOT Score",79.4600000,,,,,,-0.9305260
NSEDSGVTVDGSPSAK,ph,S,234,false,"atm and atr DNA damage response",88,25561503,"MASCOT Score",52.0000000,1.0000000,,,,,0.6100000
NSEDSGVTVDGSPSAK,ph,S,234,false,"Tissue atlas Arabidopsis - ProteomicsDB",114,32188942,"MaxQuant score",289.5800000,1.0000000,,,,0,
NSEDSGVTVDGSPSAK,ph,T,240,false,"Tissue atlas Arabidopsis - ProteomicsDB",114,32188942,"MaxQuant score",230.9700000,0.8388710,,,,0,
AAQRNSEDSGVTVDGSPSAK,ph,S,244,false,"atm and atr DNA damage response",88,25561503,"MASCOT Score",45.0000000,1.0000000,,,,,-0.2200000
NSEDSGVTVDGSPSAK,ph,S,244,false,"Tyrosine phosphorylation in Arabidopsis",59,18463617,"MASCOT Score",72.0000000,,,,,,-0.9210053
NSEDSGVTVDGSPSAK,ph,S,244,false,"Chloroplast kinase substrates",60,19376835,"MASCOT Score",49.8300000,,,,,,-0.1823680
NSEDSGVTVDGSPSAK,ph,S,244,false,"srk2dei ABA signaling phopshoproteomics",83,23572148,"MASCOT Score",81.0000000,,,,,,-0.0001000
NSEDSGVTVDGSPSAK,ph,S,244,false,"LAXIC - ABA stress",84a,23660473,XCorr,4.6500000,0.9550000,,,,1.7799999696422E-8,
NSEDSGVTVDGSPSAK,ph,S,244,false,"LAXIC - mannitol vs control",84b,23660473,XCorr,4.9000000,0.9980000,,,,0.00077133398735896,
NSEDSGVTVDGSPSAK,ph,S,244,false,"SnRK2 protein kinase substrates",85,23776212,XCorr,4.7222271,1.0000000,,,,1.0071900046838E-13,
NSEDSGVTVDGSPSAK,ph,S,244,false,"atm and atr DNA damage response",88,25561503,"MASCOT Score",102.0000000,1.0000000,,,,,-0.1000000
NSEDSGVTVDGSPSAK,ph,S,244,false,"Protein sumoylation and phosphorylation cross-talk",97,28419593,,,,,,,,
NSEDSGVTVDGSPSAK,ph,S,244,false,"TOR Kinase and ABA Receptor",100,29290610,XCorr,5.7594371,0.9329000,,,,1.7520000028526E-7,
NSEDSGVTVDGSPSAK,ph,S,244,false,"Lateral root-induction - NAA vs control",106,23328941,"MASCOT Score",63.0000000,,,,,,
NSEDSGVTVDGSPSAK,ph,S,244,false,"Phospho cell culture sucrose/TOR",109,30833711,,,0.9220990,,,,,
NSEDSGVTVDGSPSAK,ph,S,244,false,"Tissue atlas Arabidopsis - ProteomicsDB",114,32188942,"MaxQuant score",337.4500000,0.9999240,,,,0,
NSEDSGVTVDGSPSAK,ph,S,246,false,"Tissue atlas Arabidopsis - ProteomicsDB",114,32188942,"MaxQuant score",286.6500000,0.9293290,,,,0,
SVETLSPFQQK,ph,S,271,true,"Tissue atlas Arabidopsis - ProteomicsDB",114,32188942,"MaxQuant score",250.6700000,1.0000000,,,,0,
SVETLSPFQQK,ph,T,274,true,"srk2dei ABA signaling phopshoproteomics",83,23572148,"MASCOT Score",43.0000000,,,,,,-0.0002000
SVETLSPFQQK,ph,S,276,true,"Arabidopsis root NAA phosphoproteome",18a,27643528,"MaxQuant Score",50.8970000,0.8180000,,,,0.0020000000949949,0.2850000
SVETLSPFQQK,ph,S,276,true,"STN8 phosphoproteome",38,21768351,"MASCOT Score",67.7700000,,,,,,-1.2705200
SVETLSPFQQK,ph,S,276,true,"Pollen phosphoproteome Arabidopsis",43,22631563,"MASCOT Score",72.8100000,,,,,,-1.5085000
SVETLSPFQQK,ph,S,276,true,"Phosphoproteome ethylene-regulated time response",46,24043427,"MASCOT Score",55.3300000,,,,,,22.5706000
SVETLSPFQQK,ph,S,276,true,"Tyrosine phosphorylation in Arabidopsis",59,18463617,"MASCOT Score",35.0000000,,,,,,-0.2979257
SVETLSPFQQK,ph,S,276,true,"Chloroplast kinase substrates",60,19376835,"MASCOT Score",68.8500000,,,,,,-0.0062340
SVETLSPFQQK,ph,S,276,true,"Conserved plant phosphoproteome - Arabidopsis",61a,20466843,"MASCOT Score",48.0000000,1.0000000,,,,,
SVETLSPFQQK,ph,S,276,true,"srk2dei ABA signaling phopshoproteomics",83,23572148,"MASCOT Score",64.0000000,,,,,,0.0002000
SVETLSPFQQK,ph,S,276,true,"atm and atr DNA damage response",88,25561503,"MASCOT Score",65.0000000,1.0000000,,,,,-1.3700000
SVETLSPFQQK,ph,S,276,true,"Protein sumoylation and phosphorylation cross-talk",97,28419593,,,,,,,,
SVETLSPFQQK,ph,S,276,true,"TOR Kinase and ABA Receptor",100,29290610,XCorr,3.4324875,0.9995000,,,,0.00012219999916852,
SVETLSPFQQK,ph,S,276,true,"Lateral root-induction - NAA vs control",106,23328941,"MASCOT Score",29.0000000,,,,,,
SVETLSPFQQK,ph,S,276,true,"Phospho cell culture sucrose/TOR",109,30833711,,,1.0000000,,,,,
SVETLSPFQQK,ph,S,276,true,"Col-0 callus - FC Col-0 vs. Col-0 Xray",111a,31410901,,70.4700000,,0.8046191,0.0000000,NO,,0.5999768
SVETLSPFQQK,ph,S,276,true,"Col-0 X-ray callus - FC Col-0 vs. Col-0 Xray",111b,31410901,,70.4700000,,0.8046191,0.0000000,NO,,0.5999768
SVETLSPFQQK,ph,S,276,true,"atm callus - FC atm vs. atm Xray",111c,31410901,,70.4700000,,0.6876081,0.0000000,NO,,0.5999768
SVETLSPFQQK,ph,S,276,true,"atm-3 X-ray callus - FC atm vs. atm Xray",111d,31410901,,70.4700000,,0.6876081,0.0000000,NO,,0.5999768
SVETLSPFQQK,ph,S,276,true,"Tissue atlas Arabidopsis - ProteomicsDB",114,32188942,"MaxQuant score",250.6700000,1.0000000,,,,0,
SVETLSPFQQK,ph,S,276,true,"Touch-induced phosphorylation: 40s touch vs untouc",136,30291188,"MASCOT score",56.7700000,,-0.0886818,0.1776897,NO,,3.7261631
GLFVDRGVGSPR,ph,S,295,true,"STN8 phosphoproteome",38,21768351,"MASCOT Score",54.8200000,,,,,,-1.0714000
GLFVDRGVGSPR,ph,S,295,true,"Chloroplast kinase substrates",60,19376835,"MASCOT Score",52.3700000,,,,,,-0.3404160
SLSASSFLIDTK,ph,S,301,true,"srk2dei ABA signaling phopshoproteomics",83,23572148,"MASCOT Score",76.0000000,,,,,,-0.0001000
SLSASSFLIDTK,ph,S,301,true,"atm and atr DNA damage response",88,25561503,"MASCOT Score",66.0000000,1.0000000,,,,,-0.9200000
SLSASSFLIDTK,ph,S,301,true,"Phospho cell culture sucrose/TOR",109,30833711,,,0.9419120,,,,,
SLSASSFLIDTK,ph,S,303,true,"Arabidopsis root NAA phosphoproteome",18a,27643528,"MaxQuant Score",96.2470000,0.9970000,,,,1.3579999347257E-7,-0.5790000
SLSASSFLIDTK,ph,S,303,true,"Phosphorylation Early Elicitor Signaling",23,17317660,,,,,,,,
SLSASSFLIDTK,ph,S,303,true,"Mitochondrial phosphoproteome",32,19688752,"MASCOT Score",47.0600000,,,,,,11.4590000
SLSASSFLIDTK,ph,S,303,true,"STN8 phosphoproteome",38,21768351,"MASCOT Score",46.5900000,,,,,,-0.6923160
SLSASSFLIDTK,ph,S,303,true,"MAPK Arabidopsis substrates",45,23172892,"MaxQuant Score",190.4600000,,,,,,
SLSASSFLIDTK,ph,S,303,true,"Phosphoproteome ethylene-regulated time response",46,24043427,"MASCOT Score",97.0500000,,,,,,2.1894000
SLSASSFLIDTK,ph,S,303,true,"PAMP-triggered phosphorylation",48,24601666,"MASCOT Score",69.0900000,,,,,,
SLSASSFLIDTK,ph,S,303,true,"Tyrosine phosphorylation in Arabidopsis",59,18463617,"MASCOT Score",78.0000000,,,,,,-1.0388602
SLSASSFLIDTK,ph,S,303,true,"BSK8 and BSL2 regulating sucrose-ph synthase",66,24924143,"MaxQuant Score",186.0500000,,,,,,0.5912500
SLSASSFLIDTK,ph,S,303,true,"srk2dei ABA signaling phopshoproteomics",83,23572148,"MASCOT Score",95.0000000,,,,,,0.0004000
SLSASSFLIDTK,ph,S,303,true,"LAXIC - ABA stress",84a,23660473,XCorr,4.6200000,1.0000000,,,,0.0054986500181258,
SLSASSFLIDTK,ph,S,303,true,"LAXIC - mannitol vs control",84b,23660473,XCorr,4.3400000,1.0000000,,,,6.5099998209917E-6,
SLSASSFLIDTK,ph,S,303,true,"SnRK2 protein kinase substrates",85,23776212,XCorr,4.4674654,1.0000000,,,,0.0059388400986791,
SLSASSFLIDTK,ph,S,303,true,"atm and atr DNA damage response",88,25561503,"MASCOT Score",75.0000000,1.0000000,,,,,0.0900000
SLSASSFLIDTK,ph,S,303,true,"Brassinosteroid-Regulated Phosphorylation Dynamics",94,26187819,"MaxQuant Score",207.4000000,1.0000000,,,,0,1.1660000
SLSASSFLIDTK,ph,S,303,true,"Protein sumoylation and phosphorylation cross-talk",97,28419593,,,,,,,,
SLSASSFLIDTK,ph,S,303,true,"TOR Kinase and ABA Receptor",100,29290610,XCorr,4.6619377,0.9952000,,,,2.7640001007967E-6,
SLSASSFLIDTK,ph,S,303,true,"Lateral root-induction - NAA vs control",106,23328941,"MASCOT Score",66.0000000,,,,,,
SLSASSFLIDTK,ph,S,303,true,"Phospho cell culture sucrose/TOR",109,30833711,,,0.9999330,,,,,
SLSASSFLIDTK,ph,S,303,true,"Col-0 callus - FC Col-0 vs. Col-0 Xray",111a,31410901,,86.3000000,,0.7021011,0.0000000,NO,,0.2657657
SLSASSFLIDTK,ph,S,303,true,"Col-0 X-ray callus - FC Col-0 vs. Col-0 Xray",111b,31410901,,86.3000000,,0.7021011,0.0000000,NO,,0.2657657
SLSASSFLIDTK,ph,S,303,true,"atm callus - FC atm vs. atm Xray",111c,31410901,,86.3000000,,1.0869512,0.0000000,NO,,0.2657657
SLSASSFLIDTK,ph,S,303,true,"atm-3 X-ray callus - FC atm vs. atm Xray",111d,31410901,,86.3000000,,1.0869512,0.0000000,NO,,0.2657657
SLSASSFLIDTK,ph,S,303,true,"Tissue atlas Arabidopsis - ProteomicsDB",114,32188942,"MaxQuant score",270.8500000,0.9999960,,,,0,
SLSASSFLIDTK,ph,S,303,true,"Touch-induced phosphorylation: 40s touch vs untouc",136,30291188,"MASCOT score",78.1400000,,0.1649699,0.1870978,NO,,-0.5633679
SLSASSFLIDTK,ph,S,305,true,"atm and atr DNA damage response",88,25561503,"MASCOT Score",34.0000000,1.0000000,,,,,-0.5700000
SLSASSFLIDTK,ph,S,306,true,"atm and atr DNA damage response",88,25561503,"MASCOT Score",24.0000000,0.9230000,,,,,-0.1800000
HFNVGKYR,ub,K,380,true,"upl3 mutant / wildtype",168,35926874,"MaxQuant score",113.8900000,1.0000000,0.4016305,0.4023800,NO,0.0048322700895369,-0.5370300
HGVNMSADFFR,ph,S,391,true,"atm and atr DNA damage response",88,25561503,"MASCOT Score",28.0000000,1.0000000,,,,,-0.9900000
HGVNMSADFFR,ph,S,391,true,"Tissue atlas Arabidopsis - ProteomicsDB",114,32188942,"MaxQuant score",157.5000000,1.0000000,,,,1.6012799419762E-10,
HGESMDNVR,ph,S,561,true,"atm and atr DNA damage response",88,25561503,"MASCOT Score",26.0000000,1.0000000,,,,,-0.2900000
KLASFVEK,ph,S,588,true,"atm and atr DNA damage response",88,25561503,"MASCOT Score",37.0000000,1.0000000,,,,,-1.8700000
KLASFVEK,ph,S,588,true,"Tissue atlas Arabidopsis - ProteomicsDB",114,32188942,"MaxQuant score",71.0850000,1.0000000,,,,0.010035200044513,
