Peptide,PTM,ModifiedAA,ModifiedPosition,PeptideUniqueToGene,ExperimentDesc,ExpID,PubmedID,ScoreType,IdentScore,LocProb,Log2FChange,PQ-val,QuantSig,PEP,MassErrorPPM
MESADSGRSDPVKGDDPGPSFVSSPPATPSR,ph,S,6,true,"Tissue atlas Arabidopsis - ProteomicsDB",114,32188942,"MaxQuant score",99.9070000,0.8550420,,,,6.8765498146181E-25,
SDPVKGDDPGPSFVSSPPATPSR,ub,K,13,true,"Arabidopsis ubiquitination COFRADIC",40,26744219,"MaxQuant Score",87.5110000,1.0000000,,,,1.3550000301765E-26,-0.7480000
SDPVKGDDPGPSFVSSPPATPSR,ph,S,24,true,"LAXIC - ABA stress",84a,23660473,XCorr,4.6900000,0.9170000,,,,1.4400000081238E-9,
SDPVKGDDPGPSFVSSPPATPSR,ph,S,24,true,"LAXIC - mannitol vs control",84b,23660473,XCorr,3.7400000,0.8450000,,,,8.3999999881193E-13,
SDPVKGDDPGPSFVSSPPATPSR,ph,S,24,true,"SnRK2 protein kinase substrates",85,23776212,XCorr,3.6932592,0.9400000,,,,0.0013538299826905,
SDPVKGDDPGPSFVSSPPATPSR,ph,S,24,true,"Tissue atlas Arabidopsis - ProteomicsDB",114,32188942,"MaxQuant score",222.0600000,0.9767790,,,,0,
GDDPGPSFVSSPPATPSR,ph,S,24,true,"srk2dei ABA signaling phopshoproteomics",83,23572148,"MASCOT Score",56.0000000,,,,,,0.0010000
SDPVKGDDPGPSFVSSPPATPSR,ph,T,28,true,"Tissue atlas Arabidopsis - ProteomicsDB",114,32188942,"MaxQuant score",90.4750000,0.8040920,,,,1.0852999610123E-9,
GDDPGPSFVSSPPATPSRYESQK,ph,S,34,true,"TOR Kinase and ABA Receptor",100,29290610,XCorr,3.2365193,0.9297000,,,,0.027049999684095,
VHVAACPYFGHQQPPSPCSCPLK,ph,S,94,true,"Phospho cell culture sucrose/TOR",109,30833711,,,0.9305310,,,,,
VHVAACPYFGHQQPPSPCSCPLK,ph,S,94,true,"Tissue atlas Arabidopsis - ProteomicsDB",114,32188942,"MaxQuant score",100.2700000,0.9546250,,,,6.9966498957366E-13,
