Peptide,PTM,ModifiedAA,ModifiedPosition,PeptideUniqueToGene,ExperimentDesc,ExpID,PubmedID,ScoreType,IdentScore,LocProb,Log2FChange,PQ-val,QuantSig,PEP,MassErrorPPM
SAASSDQLSVSTQAKN,nta,S,52,true,"HUNTER N-terminome: legumain, GluC and trypsin",119,31951383,"MaxQuant score",116.7400000,,,,,,
SAASSDQLSVSTQAK,nta,S,52,true,"Characterization plant N-terminal acetylation",6,22223895,"MASCOT Score",82.8000000,,,,,,
AASSDQLSVSTQAKN,nta,A,53,true,"HUNTER N-terminome: legumain, GluC and trypsin",119,31951383,"MaxQuant score",61.4800000,,,,,,
AASSDQLSVSTQAK,nta,A,53,true,"Characterization plant N-terminal acetylation",6,22223895,"MASCOT Score",93.6500000,,,,,,
YVTSVLPTEGQSLK,ph,Y,196,true,"Large-scale phosphorylation discovery",44,23111157,XCorr,2.5540000,,,,,,
GDEVAKIVK,ac,K,215,true,"Histone deacetylases - apicidin vs control",98a,29061669,"MaxQuant Score",123.8000000,1.0000000,-0.0410000,0.7979947,NO,0.0049999998882413,
FKNALGIDEPDAAAMHMEIGRR,ac,K,220,true,"Quantitative Acetylproteomics",101,29440448,,,,,,,,
FKNALGIDEPDAAAMHMEIGR,ac,K,220,true,"Quantitative Acetylproteomics",101,29440448,,,,,,,,
QFARGVGPISLIGDESD,nt,Q,399,true,"HUNTER N-terminome: legumain, GluC and trypsin",119,31951383,"MaxQuant score",88.4410000,,,,,,
RMDDLKLLYR,ac,K,424,true,"Quantitative Acetylproteomics",101,29440448,,,,,,,,
MDDLKLLYR,ac,K,424,true,"Histone deacetylases - apicidin vs control",98a,29061669,"MaxQuant Score",44.3000000,1.0000000,0.1910000,0.4436086,NO,0.010999999940395,
MDDLKLLYR,ac,K,424,true,"Quantitative Acetylproteomics",101,29440448,,,,,,,,
NILGLGKR,ac,K,459,true,"Quantitative Acetylproteomics",101,29440448,,,,,,,,
RLANAVSSGDLEAQDSK,ph,S,483,true,"TOR Kinase and ABA Receptor",100,29290610,XCorr,4.6549020,0.9063000,,,,1.0849999853235E-5,
LANAVSSGDLEAQDSK,ph,S,483,true,"atm and atr DNA damage response",88,25561503,"MASCOT Score",49.0000000,0.9950000,,,,,-0.7500000
LANAVSSGDLEAQDSK,ph,S,483,true,"Tissue atlas Arabidopsis - ProteomicsDB",114,32188942,"MaxQuant score",257.2900000,0.9954920,,,,0,
LANAVSSGDLEAQDSKAK,ac,K,493,true,"Quantitative Acetylproteomics",101,29440448,,,,,,,,
LCEELHFDAQK,sno,C,501,true,"Site-specific nitrosomeproteomic id - gsnor1-3",90b,25699590,XCorr,2.1400000,,,,,0.0010450000409037,-6.8200000
LCEELHFDAQK,so,C,501,true,"Arabidopsis S-sulfenylation chemoproteomics",108,31578252,"pFind PSM Score",0.0148341,,1.0101000,,,,-0.5373481
LCEELHFDAQK,so,C,501,true,"S-sulfenylation site detection using YAP1C",110,32714340,,,,,,,,
QKLQQCVTDGELSDDNVAALLR,nt,Q,521,true,"HUNTER N-terminome: legumain, GluC and trypsin",119,31951383,"MaxQuant score",62.6840000,,,,,,
VTDGELSDDNVAALLR,nt,V,527,true,"Arg/N-end rule seed, prt6 vs. Wt",99,29168982,"MASCOT Score",25.8800000,,0.1648141,0.8390766,NO,0.13320000469685,-1.4081210
TYLLYCVTGEVTR,ox,C,728,true,"SPEAR - 10 mM H2O2 / mock",138a,34619326,,,,2.0634662,0.0261821,YES,,
QQAEVILADGQLTKAR,nt,Q,782,true,"HUNTER N-terminome: legumain, GluC and trypsin",119,31951383,"MaxQuant score",59.8980000,,,,,,
QQAEVILADGQLTKAR,ac,K,795,true,"Quantitative Acetylproteomics",101,29440448,,,,,,,,
VIKNITTTK,ac,K,820,true,"Quantitative Acetylproteomics",101,29440448,,,,,,,,
GVVLSLNDLLACDK,so,C,944,true,"S-sulfenylation site detection using YAP1C",110,32714340,,,,,,,,
