Peptide,PTM,ModifiedAA,ModifiedPosition,PeptideUniqueToGene,ExperimentDesc,ExpID,PubmedID,ScoreType,IdentScore,LocProb,Log2FChange,PQ-val,QuantSig,PEP,MassErrorPPM
VSSSVVASTVQGTKRDGGE,nt,V,57,true,"N-terminal ChaFRADIC",92,26010716,"MASCOT Score",36.6700000,,,,,4.5199998567114E-5,
VSSSVVASTVQGTKRDGGE,nt,V,57,true,"Arg/N-end rule seed, prt6 vs. Wt",99,29168982,"MASCOT Score",65.0000000,,,,,4.536000020039E-8,1.6498709
VSSSVVASTVQGTKR,nt,V,57,true,"N-terminal ChaFRADIC",92,26010716,"MASCOT Score",49.5600000,,,,,1.7129999605459E-6,
VSSSVVASTVQGTKR,nt,V,57,true,"Arg/N-end rule seed, prt6 vs. Wt",99,29168982,"MASCOT Score",51.5100000,,,,,0.001609000028111,-1.4435535
VSSSVVASTVQGTKRDGGE,nta,V,57,true,"N-terminal ChaFRADIC",92,26010716,"MASCOT Score",36.6700000,,,,,4.5199998567114E-5,
VSSSVVASTVQGTKRDGGE,nta,V,57,true,"Arg/N-end rule seed, prt6 vs. Wt",99,29168982,"MASCOT Score",65.0000000,,-0.0468490,0.7563838,NO,4.536000020039E-8,1.6498709
VSSSVVASTVQGTKR,nta,V,57,true,"N-terminal ChaFRADIC",92,26010716,"MASCOT Score",49.5600000,,,,,1.7129999605459E-6,
VSSSVVASTVQGTKR,nta,V,57,true,"Arg/N-end rule seed, prt6 vs. Wt",99,29168982,"MASCOT Score",51.5100000,,-0.0480522,0.8015980,NO,0.001609000028111,-1.4435535
VSSSVVASTVQGTKR,nta,V,57,true,"Arabidopsis translation initiation landscape - NTA",167a,35069635,,,,,,,,
VSSSVVASTVQGTK,nta,V,57,true,"Characterization plant N-terminal acetylation",6,22223895,"MASCOT Score",78.0000000,,,,,,
ANVKSIILDHGK,ac,K,330,true,"Quantitative Acetylproteomics",101,29440448,,,,,,,,
