Peptide,PTM,ModifiedAA,ModifiedPosition,PeptideUniqueToGene,ExperimentDesc,ExpID,PubmedID,ScoreType,IdentScore,LocProb,Log2FChange,PQ-val,QuantSig,PEP,MassErrorPPM
AYSACFLHQSALASSAAR,nta,A,2,true,"HUNTER N-terminome: legumain, GluC and trypsin",119,31951383,"MaxQuant score",121.7600000,,,,,,
KAQQSHEDDNSAVSR,nt,K,41,true,"Arg/N-end rule seed, prt6 vs. Wt",99,29168982,"MASCOT Score",22.6400000,,3.0226003,0.0180181,YES,0.070029996335506,2.3353043
AQQSHEDDNSAVSR,nt,A,42,true,"Arg/N-end rule seed, prt6 vs. Wt",99,29168982,"MASCOT Score",51.8100000,,4.1075398,0.0006604,YES,0.0012659999774769,-1.0608053
AYGEAANVFGKPKTNT,nt,A,78,true,"Arabidopsis translation initiation landscape - NT",167b,35069635,,,,,,,,
AYGEAANVFGKPKTN,nt,A,78,true,"HUNTER N-terminome: legumain, GluC and trypsin",119,31951383,"MaxQuant score",128.0600000,,,,,,
AYGEAANVF,nt,A,78,true,"N-terminal ChaFRADIC",92,26010716,"MASCOT Score",62.2600000,,,,,2.1759999526694E-6,
EAANVFGKPKTNTDFLPYNGD,nt,E,81,true,"HUNTER N-terminome: legumain, GluC and trypsin",119,31951383,"MaxQuant score",72.6440000,,,,,,
TNTDFLPYNGDGFKVQVPAK,ac,K,104,true,"Histone deacetylases substrates - hda14 vs WT",98e,29061669,"MaxQuant Score",50.2000000,1.0000000,-0.0210000,0.9931160,NO,0.00031000000308268,
VQVPAKWNPSK,ac,K,110,true,"Histone deacetylases substrates - TSA vs control",98b,29061669,"MaxQuant Score",53.2000000,1.0000000,0.0900000,0.9977001,NO,0.014000000432134,
VQVPAKWNPSK,ac,K,110,true,"Histone deacetylases - hda14 vs WT (thylakoids)",98d,29061669,"MaxQuant Score",79.5000000,1.0000000,0.2600000,0.9268298,NO,0.0020000000949949,
WNPSKEIEYPGQVLR,ac,K,115,true,"Histone deacetylases - apicidin vs control",98a,29061669,"MaxQuant Score",94.7000000,1.0000000,-0.2700000,0.2786121,NO,1.1000000085915E-5,
FEDNFDATSNLNVMVTPTDKK,ph,S,134,true,"Large-scale phosphorylation discovery",44,23111157,XCorr,3.8780000,,,,,,
FEDNFDATSNLNVMVTPTDKK,ph,S,134,true,"srk2dei ABA signaling phopshoproteomics",83,23572148,"MASCOT Score",45.0000000,,,,,,0.0000000
FEDNFDATSNLNVMVTPTDKK,ph,S,134,true,"Tissue atlas Arabidopsis - ProteomicsDB",114,32188942,"MaxQuant score",335.3900000,0.9992250,,,,0,
FEDNFDATSNLNVMVTPTDK,ph,S,134,true,"LAXIC - mannitol vs control",84b,23660473,XCorr,2.7800000,0.7710000,,,,0.069729402661324,
FEDNFDATSNLNVMVTPTDKK,ph,T,141,true,"Large-scale phosphorylation discovery",44,23111157,XCorr,4.1500000,,,,,,
FEDNFDATSNLNVMVTPTDKK,ph,T,141,true,"srk2dei ABA signaling phopshoproteomics",83,23572148,"MASCOT Score",38.0000000,,,,,,-0.0010000
FEDNFDATSNLNVMVTPTDKK,ph,T,141,true,"Tissue atlas Arabidopsis - ProteomicsDB",114,32188942,"MaxQuant score",264.5400000,0.9331690,,,,0,
FEDNFDATSNLNVMVTPTDK,ph,T,141,true,"LAXIC - mannitol vs control",84b,23660473,XCorr,2.7800000,0.8860000,,,,0.069729402661324,
FEDNFDATSNLNVMVTPTDK,ph,T,143,true,"LAXIC - mannitol vs control",84b,23660473,XCorr,2.7800000,0.8860000,,,,0.069729402661324,
SITDYGSPEEFLSQVNYLLGK,ph,S,147,true,"TOR Kinase and ABA Receptor",100,29290610,XCorr,4.5395451,0.8953000,,,,2.8130000373494E-6,
SPEEFLSQVN,nt,S,153,true,"HUNTER N-terminome: legumain, GluC and trypsin",119,31951383,"MaxQuant score",72.4850000,,,,,,
TASEGGFDNNAVATANILE,nt,T,174,true,"N-terminal ChaFRADIC",92,26010716,"MASCOT Score",87.8400000,,,,,7.3540002176742E-7,
SEGGFDNNAVATANILESSSQEVGGKPYYYLSVLTR,nt,S,176,true,"HUNTER N-terminome: legumain, GluC and trypsin",119,31951383,"MaxQuant score",54.7030000,,,,,,
SEGGFDNN,nt,S,176,true,"N-terminal ChaFRADIC",92,26010716,"MASCOT Score",48.8900000,,,,,0.0092089995741844,
TANILESSSQEVGGKPYYYLSVLTR,nt,T,187,true,"HUNTER N-terminome: legumain, GluC and trypsin",119,31951383,"MaxQuant score",66.8710000,,,,,,
TADGDEGGKHQLITATVNGGK,ac,K,220,false,"Histone deacetylases - hda14 vs WT (thylakoids)",98d,29061669,"MaxQuant Score",65.2000000,1.0000000,0.1390000,0.9862795,NO,4.509999840252E-8,
TADGDEGGKHQLITATVNGGK,ac,K,220,false,"Quantitative Acetylproteomics",101,29440448,,,,,,,,
HQLITATVNGGK,ac,K,232,false,"Quantitative Acetylproteomics",101,29440448,,,,,,,,
LYICKAQAGDK,ac,K,237,false,"Histone deacetylases substrates - TSA vs control",98b,29061669,"MaxQuant Score",52.5000000,1.0000000,0.2760000,0.9977001,NO,0.014999999664724,
LYICKAQAGDK,ac,K,237,false,"Histone deacetylases- hda14 vs WT (low light)",98c,29061669,"MaxQuant Score",126.5000000,1.0000000,-0.7380000,0.9885531,NO,1.4999999621068E-5,
LYICKAQAGDK,ac,K,237,false,"Histone deacetylases - hda14 vs WT (thylakoids)",98d,29061669,"MaxQuant Score",57.2000000,1.0000000,1.1600000,0.8394600,NO,0.012000000104308,
LYICKAQAGDKR,hib,K,237,false,"Open search Plant PTM Viewer 2.0 - hib",164e,TBA,,,,,,,,
AQAGDKR,ac,K,243,false,"Quantitative Acetylproteomics",101,29440448,,,,,,,,
SAATSFSVA,nt,S,255,true,"N-terminal ChaFRADIC",92,26010716,"MASCOT Score",50.6600000,,,,,0.010769999586046,
