Peptide,PTM,ModifiedAA,ModifiedPosition,PeptideUniqueToGene,ExperimentDesc,ExpID,PubmedID,ScoreType,IdentScore,LocProb,Log2FChange,PQ-val,QuantSig,PEP,MassErrorPPM
GHQNAAVSENQNHD,nt,G,2,true,"Arabidopsis translation initiation landscape - NT",167b,35069635,,,,,,,,
GHQNAAVSE,nt,G,2,true,"Arg/N-end rule seed, prt6 vs. Wt",99,29168982,"MASCOT Score",49.6200000,,0.2476610,0.7134445,NO,0.0039249998517334,-1.6667906
GHQNAAVSENQNHDDGAASSPGFK,ph,S,20,true,"Tissue atlas Arabidopsis - ProteomicsDB",114,32188942,"MaxQuant score",292.9100000,0.7586300,,,,0,
GHQNAAVSENQNHDDGAASSPGFK,ph,S,21,true,"Col-0 callus - FC Col-0 vs. Col-0 Xray",111a,31410901,,43.1400000,,-0.8458623,0.0000000,NO,,0.8284947
GHQNAAVSENQNHDDGAASSPGFK,ph,S,21,true,"Col-0 X-ray callus - FC Col-0 vs. Col-0 Xray",111b,31410901,,43.1400000,,-0.8458623,0.0000000,NO,,0.8284947
GHQNAAVSENQNHDDGAASSPGFK,ph,S,21,true,"atm callus - FC atm vs. atm Xray",111c,31410901,,43.1400000,,5.4250187,0.0000000,NO,,0.8284947
GHQNAAVSENQNHDDGAASSPGFK,ph,S,21,true,"atm-3 X-ray callus - FC atm vs. atm Xray",111d,31410901,,43.1400000,,5.4250187,0.0000000,NO,,0.8284947
GHQNAAVSENQNHDDGAASSPGFK,ph,S,21,true,"Tissue atlas Arabidopsis - ProteomicsDB",114,32188942,"MaxQuant score",336.7300000,0.9884760,,,,0,
FLFTAPYSPSLSAGEIKPTTTASIPSFDHGSCR,ub,K,113,true,"upl3 mutant / wildtype",168,35926874,"MaxQuant score",62.2130000,1.0000000,-0.0276750,,,5.3621400653014E-9,0.3195400
AYQSGGCGGFGK,ox,C,416,true,"OxiTRAQ Arabidopsis - 5 mM H2O2 versus control",47,24376095,,,,-0.3002901,0.1045009,NO,,
AYQSGGCGGFGK,sno,C,416,true,"hot5-4 / wildtype, FAT-switch S-nitrosoproteome",169,37277371,,,,,,,,
GNFSELFK,ph,S,425,true,"atm and atr DNA damage response",88,25561503,"MASCOT Score",36.0000000,1.0000000,,,,,-1.4700000
