Peptide,PTM,ModifiedAA,ModifiedPosition,PeptideUniqueToGene,ExperimentDesc,ExpID,PubmedID,ScoreType,IdentScore,LocProb,Log2FChange,PQ-val,QuantSig,PEP,MassErrorPPM
PASPDDVLENLGMNLK,ph,S,70,true,"atm and atr DNA damage response",88,25561503,"MASCOT Score",31.0000000,1.0000000,,,,,-0.3100000
TTGFDSSSPAYAAPHFSKPAK,ph,S,140,true,"Tissue atlas Arabidopsis - ProteomicsDB",114,32188942,"MaxQuant score",101.9800000,0.9521920,,,,7.352919939585E-10,
EDIFFPSLSPNLQK,ph,S,162,true,"TOR Kinase and ABA Receptor",100,29290610,XCorr,4.0534258,0.9950000,,,,0.00014200000441633,
EDIFFPSLSPNLQK,ph,S,162,true,"Touch-induced phosphorylation: 40s touch vs untouc",136,30291188,"MASCOT score",55.8600000,,0.2212402,0.5717597,NO,,2.0402033
LANLGTVWSPR,ph,S,185,true,"atm and atr DNA damage response",88,25561503,"MASCOT Score",39.0000000,0.9950000,,,,,-0.4300000
LANLGTVWSPR,ph,S,185,true,"TOR Kinase and ABA Receptor",100,29290610,XCorr,3.6139300,0.9922000,,,,0.0014359999913722,
LANLGTVWSPR,ph,S,185,true,"Tissue atlas Arabidopsis - ProteomicsDB",114,32188942,"MaxQuant score",207.7300000,0.9999920,,,,1.2640299895819E-24,
LANLGTVWSPR,ph,S,185,true,"Touch-induced phosphorylation: 40s touch vs untouc",136,30291188,"MASCOT score",67.2700000,,0.1241235,0.6752054,NO,,9.6326225
VDAGTKASILGYHK,ph,S,240,true,"Tissue atlas Arabidopsis - ProteomicsDB",114,32188942,"MaxQuant score",83.7580000,0.9883800,,,,7.874929724494E-5,
