Peptide,PTM,ModifiedAA,ModifiedPosition,PeptideUniqueToGene,ExperimentDesc,ExpID,PubmedID,ScoreType,IdentScore,LocProb,Log2FChange,PQ-val,QuantSig,PEP,MassErrorPPM
DEQGQGVSSSRMSYSRFLEYLD,nt,D,74,true,"HUNTER N-terminome: legumain, GluC and trypsin",119,31951383,"MaxQuant score",63.4540000,,,,,,
DEQGQGVSSSRMSYSRFLE,nt,D,74,true,"HUNTER N-terminome: legumain, GluC and trypsin",119,31951383,"MaxQuant score",80.3160000,,,,,,
DEQGQGVSSSR,nt,D,74,true,"N-terminal ChaFRADIC",92,26010716,"MASCOT Score",42.2500000,,,,,6.5530002757441E-5,
FLEYLDKGR,ac,K,96,true,"Quantitative Acetylproteomics",101,29440448,,,,,,,,
VQLPGLSQELLQKLR,ac,K,141,false,"Histone deacetylases - hda14 vs WT (thylakoids)",98d,29061669,"MaxQuant Score",123.4000000,1.0000000,0.3770000,0.8394600,NO,9.4499998937181E-9,
QSKAKFQMEPNTGVTFDDVAGVDE,nt,Q,204,false,"HUNTER N-terminome: legumain, GluC and trypsin",119,31951383,"MaxQuant score",,,,,,,
ENAPCIVFVDEIDAVGR,sno,C,314,false,"hot5-4 / wildtype, FAT-switch S-nitrosoproteome",169,37277371,,,,0.2329353,0.3002108,NO,,
QRGTGIGGGNDER,ph,T,330,false,"atm and atr DNA damage response",88,25561503,"MASCOT Score",54.0000000,1.0000000,,,,,-0.7100000
GTGIGGGNDER,ph,T,330,false,"atm and atr DNA damage response",88,25561503,"MASCOT Score",45.0000000,1.0000000,,,,,-0.2500000
QLLTEMDGFEGN,nt,Q,345,false,"HUNTER N-terminome: legumain, GluC and trypsin",119,31951383,"MaxQuant score",91.5490000,,,,,,
ADILDSALLRPGR,ph,S,373,false,"atm and atr DNA damage response",88,25561503,"MASCOT Score",36.0000000,1.0000000,,,,,-0.8300000
QVSVDVPDVKGR,nt,Q,384,false,"HUNTER N-terminome: legumain, GluC and trypsin",119,31951383,"MaxQuant score",52.7900000,,,,,,
QVSVDVPDVK,ph,S,386,false,"atm and atr DNA damage response",88,25561503,"MASCOT Score",56.0000000,1.0000000,,,,,0.2300000
QVSVDVPDVK,ph,S,386,false,"Tissue atlas Arabidopsis - ProteomicsDB",114,32188942,"MaxQuant score",186.3600000,1.0000000,,,,4.2264500232925E-10,
QVSVDVPDVKGR,ac,K,393,false,"Quantitative Acetylproteomics",101,29440448,,,,,,,,
GKTAISSK,ac,K,445,true,"Quantitative Acetylproteomics",101,29440448,,,,,,,,
IVAGMEGTVMTDGKSK,ac,K,473,false,"Quantitative Acetylproteomics",101,29440448,,,,,,,,
