Peptide,PTM,ModifiedAA,ModifiedPosition,PeptideUniqueToGene,ExperimentDesc,ExpID,PubmedID,ScoreType,IdentScore,LocProb,Log2FChange,PQ-val,QuantSig,PEP,MassErrorPPM
ASEPVNGGEGIDGAREKQIIKVY,nta,A,2,true,"Arabidopsis translation initiation landscape - NTA",167a,35069635,,,,,,,,
ASEPVNGGEGIDGARE,nta,A,2,true,"HUNTER N-terminome: legumain, GluC and trypsin",119,31951383,"MaxQuant score",133.7100000,,,,,,
ASEPVNGGEGIDGAR,nta,A,2,true,"Arg/N-end rule pathway Roots",80,25728785,"MASCOT Score",72.8300000,,,,,4.6029999793973E-6,
ASEPVNGGEGIDGAR,nta,A,2,true,"HUNTER N-terminome: legumain, GluC and trypsin",119,31951383,"MaxQuant score",140.3100000,,,,,,
ASEPVNGGEGIDGAR,ph,S,3,true,"Lateral root-induction - NAA vs control",106,23328941,"MASCOT Score",23.0000000,,,,,,
NSIEEAALGTNSHGDK,ph,T,88,true,"Lateral root-induction - NAA vs control",106,23328941,"MASCOT Score",24.0000000,,,,,,
NSIEEAALGTNSHGDK,ph,S,90,true,"Large-scale phosphorylation discovery",44,23111157,XCorr,3.6420000,,,,,,
NSIEEAALGTNSHGDK,ph,S,90,true,"atm and atr DNA damage response",88,25561503,"MASCOT Score",54.0000000,1.0000000,,,,,-0.0700000
NSIEEAALGTNSHGDK,ph,S,90,true,"TOR Kinase and ABA Receptor",100,29290610,XCorr,3.1045191,0.8732000,,,,0.010619999840856,
NSIEEAALGTNSHGDK,ph,S,90,true,"Tissue atlas Arabidopsis - ProteomicsDB",114,32188942,"MaxQuant score",370.8700000,0.9999100,,,,0,
NLTEAPSENLPGDDSDK,ph,S,101,true,"Tissue atlas Arabidopsis - ProteomicsDB",114,32188942,"MaxQuant score",145.8200000,0.9999990,,,,3.0667400043038E-12,
NLTEAPSENLPGDDSDK,ph,S,109,true,"TOR Kinase and ABA Receptor",100,29290610,XCorr,4.0166101,1.0000000,,,,0.00090839999029413,
NPIEAPSQTLSLEDGDTLVVDK,ph,T,190,true,"Lateral root-induction - NAA vs control",106,23328941,"MASCOT Score",21.0000000,,,,,,
NPIEAPSQTLSLEDGDTLVVDK,ph,S,192,true,"TOR Kinase and ABA Receptor",100,29290610,XCorr,6.3393164,0.9988000,,,,6.9290003068545E-8,
NPIEAPSQTLSLEDGDTLVVDK,ph,S,192,true,"Lateral root-induction - NAA vs control",106,23328941,"MASCOT Score",47.0000000,,,,,,
NPIEAPSQTLSLEDGDTLVVDK,ph,S,192,true,"Tissue atlas Arabidopsis - ProteomicsDB",114,32188942,"MaxQuant score",72.1670000,0.7950600,,,,4.2048700379382E-6,
NPIEVSSEEDVHVIDADNLIK,ph,S,209,true,"srk2dei ABA signaling phopshoproteomics",83,23572148,"MASCOT Score",62.0000000,,,,,,-0.0013000
NPIEVSSEEDVHVIDADNLIK,ph,S,209,true,"Brassinosteroid-Regulated Phosphorylation Dynamics",94,26187819,"MaxQuant Score",91.5890000,1.0000000,,,,0.00088529998902231,0.5490000
NPIEVSSEEDVHVIDADNLIK,ph,S,209,true,"TOR Kinase and ABA Receptor",100,29290610,XCorr,5.7142839,1.0000000,,,,8.1029997090809E-5,
NPIEVSSEEDVHVIDADNLIK,ph,S,209,true,"Lateral root-induction - NAA vs control",106,23328941,"MASCOT Score",28.0000000,,,,,,
NPIEVSSEEDVHVIDADNLIK,ph,S,209,true,"Phospho cell culture sucrose/TOR",109,30833711,,,1.0000000,,,,,
NPIEVSSEEDVHVIDADNLIK,ph,S,209,true,"Tissue atlas Arabidopsis - ProteomicsDB",114,32188942,"MaxQuant score",207.1700000,1.0000000,,,,0,
NPIEVSSEEDVHVIDADNLIK,ph,S,210,true,"srk2dei ABA signaling phopshoproteomics",83,23572148,"MASCOT Score",62.0000000,,,,,,-0.0013000
NPIEVSSEEDVHVIDADNLIK,ph,S,210,true,"Brassinosteroid-Regulated Phosphorylation Dynamics",94,26187819,"MaxQuant Score",91.5890000,1.0000000,,,,0.00088529998902231,0.5490000
NPIEVSSEEDVHVIDADNLIK,ph,S,210,true,"TOR Kinase and ABA Receptor",100,29290610,XCorr,5.7142839,1.0000000,,,,8.1029997090809E-5,
NPIEVSSEEDVHVIDADNLIK,ph,S,210,true,"Lateral root-induction - NAA vs control",106,23328941,"MASCOT Score",28.0000000,,,,,,
NPIEVSSEEDVHVIDADNLIK,ph,S,210,true,"Tissue atlas Arabidopsis - ProteomicsDB",114,32188942,"MaxQuant score",205.6500000,1.0000000,,,,0,
ILSGFASAGLPR,ph,S,335,true,"Tissue atlas Arabidopsis - ProteomicsDB",114,32188942,"MaxQuant score",118.2400000,0.9999900,,,,3.4138098271796E-5,
NSEFLLGDKLPPAESNK,ac,K,390,true,"Histone deacetylases - apicidin vs control",98a,29061669,"MaxQuant Score",42.1000000,1.0000000,0.2710000,0.3689776,NO,0.00022000000171829,
NSEFLLGDKLPPAESNK,ac,K,390,true,"Histone deacetylases substrates - hda14 vs WT",98e,29061669,"MaxQuant Score",65.4000000,1.0000000,0.4910000,0.6622165,NO,4.7000001359265E-5,
NCSALLER,ox,C,425,true,"OxiTRAQ SA and flg22 responses - SA vs mock",91a,25720653,"MASCOT Score",27.1000000,,0.0840643,0.2380000,NO,,
NCSALLER,ox,C,425,true,"OxiTRAQ SA and flg22 responses - flg22 vs mock",91b,25720653,"MASCOT Score",27.1000000,,0.7224660,0.0020000,YES,,
FVTGYEMNLPTPTMR,ph,T,542,true,"Tissue atlas Arabidopsis - ProteomicsDB",114,32188942,"MaxQuant score",218.8300000,0.9996040,,,,0,
QPTTTPGRTPTSATPSGR,ph,T,576,true,"atm and atr DNA damage response",88,25561503,"MASCOT Score",27.0000000,0.8960000,,,,,-1.1700000
QPTTTPGRTPTSATPSGR,ph,T,577,true,"atm and atr DNA damage response",88,25561503,"MASCOT Score",27.0000000,0.9770000,,,,,-1.1700000
QPTTTPGRTPTSATPSGR,ph,T,577,true,"Phospho cell culture sucrose/TOR",109,30833711,,,0.9626390,,,,,
QPTTTPGRTPTSATPSGR,ph,T,577,true,"Tissue atlas Arabidopsis - ProteomicsDB",114,32188942,"MaxQuant score",145.7100000,0.9948790,,,,4.5795899594749E-35,
QPTTTPGRTPTSATPSGR,ph,T,581,true,"TOR Kinase and ABA Receptor",100,29290610,XCorr,2.0540946,0.9968000,,,,0.043320000171661,
QPTTTPGRTPTSATPSGR,ph,T,581,true,"Tissue atlas Arabidopsis - ProteomicsDB",114,32188942,"MaxQuant score",145.7100000,0.9979870,,,,4.6040401345207E-22,
QPTTTPGRTPTSATPSGR,ph,T,586,true,"Tissue atlas Arabidopsis - ProteomicsDB",114,32188942,"MaxQuant score",100.5300000,0.8394680,,,,1.9271699329693E-6,
TPTSATPSGR,ph,T,586,true,"atm and atr DNA damage response",88,25561503,"MASCOT Score",33.0000000,0.9950000,,,,,-0.4600000
TPTSATPSGRTPALK,ph,S,588,true,"Tissue atlas Arabidopsis - ProteomicsDB",114,32188942,"MaxQuant score",104.8400000,0.8413800,,,,2.972929905809E-6,
TPTSATPSGR,ph,S,588,true,"atm and atr DNA damage response",88,25561503,"MASCOT Score",25.0000000,0.9850000,,,,,0.0500000
TPTSATPSGRTPALK,ph,T,591,true,"Tissue atlas Arabidopsis - ProteomicsDB",114,32188942,"MaxQuant score",170.9200000,0.7995350,,,,3.8766699527469E-17,
DMTYEEKQK,ac,K,612,true,"Quantitative Acetylproteomics",101,29440448,,,,,,,,
AEAERNSQQQMAPAPAAHEFSR,ph,S,695,true,"atm and atr DNA damage response",88,25561503,"MASCOT Score",57.0000000,1.0000000,,,,,-0.6200000
AEAERNSQQQMAPAPAAHEFSR,ph,S,695,true,"Tissue atlas Arabidopsis - ProteomicsDB",114,32188942,"MaxQuant score",66.0140000,0.9999980,,,,1.8187100067735E-5,
NSQQQMAPAPAAHEFSR,ph,S,709,true,"Tissue atlas Arabidopsis - ProteomicsDB",114,32188942,"MaxQuant score",158.0800000,1.0000000,,,,2.6466100302332E-16,
KTLPTPLPSQVEK,ac,K,718,true,"Histone deacetylases- hda14 vs WT (low light)",98c,29061669,"MaxQuant Score",121.9900000,1.0000000,0.0440000,0.9931160,NO,2.7000000045518E-5,
