Peptide,PTM,ModifiedAA,ModifiedPosition,PeptideUniqueToGene,ExperimentDesc,ExpID,PubmedID,ScoreType,IdentScore,LocProb,Log2FChange,PQ-val,QuantSig,PEP,MassErrorPPM
MESSLYDEFGNYVGPEIESDRDSDDEVEDEDLQDK,ph,S,19,true,"TOR Kinase and ABA Receptor",100,29290610,XCorr,4.3788433,0.9998000,,,,0.00054159999126568,
MESSLYDEFGNYVGPEIESDRDSDDEVEDEDLQDK,ph,S,23,true,"TOR Kinase and ABA Receptor",100,29290610,XCorr,4.3788433,0.9998000,,,,0.00054159999126568,
DSDDEVEDEDLQDK,ph,S,23,true,"Tissue atlas Arabidopsis - ProteomicsDB",114,32188942,"MaxQuant score",158.8900000,1.0000000,,,,8.6626300750681E-13,
HLEENGSDGEQGPGGSNGWITTINDVEMENQIVLPEDKK,ph,S,42,true,"Tissue atlas Arabidopsis - ProteomicsDB",114,32188942,"MaxQuant score",255.8300000,1.0000000,,,,0,
HLEENGSDGEQGPGGSNGWITTINDVEMENQIVLPEDK,ph,S,42,true,"TOR Kinase and ABA Receptor",100,29290610,XCorr,5.1907697,0.9995000,,,,1.5140000186875E-6,
HLEENGSDGEQGPGGSNGWITTINDVEMENQIVLPEDK,ph,S,51,true,"TOR Kinase and ABA Receptor",100,29290610,XCorr,4.6393628,0.9239000,,,,0.001475999946706,
SKSYLCNIMDTPGHVNFSDEMTASLR,nt,S,206,true,"Arabidopsis translation initiation landscape - NT",167b,35069635,,,,,,,,
LACSSVFGSASGFTDMLVK,so,C,434,false,"S-sulfenylation site detection using YAP1C",110,32714340,,,,,,,,
TATLCNASYDEDVYIFR,so,C,580,false,"S-sulfenylation site detection using YAP1C",110,32714340,,,,,,,,
VADPVVSFCETVVESSSMK,so,C,677,false,"S-sulfenylation site detection using YAP1C",110,32714340,,,,,,,,
CFAETPNKK,ox,C,688,false,"SPEAR - 10 mM H2O2 / mock",138a,34619326,,,,-0.3201652,0.0354845,YES,,
CFAETPNKK,so,C,688,false,"S-sulfenylation site detection using YAP1C",110,32714340,,,,,,,,
EGPLCDEPIR,ox,C,794,false,"OxiTRAQ Arabidopsis - 5 mM H2O2 versus control",47,24376095,,,,-0.1973650,0.0384907,NO,,
EGPLCDEPIRNVK,so,C,794,false,"S-sulfenylation site detection using YAP1C",110,32714340,,,,,,,,
