Peptide,PTM,ModifiedAA,ModifiedPosition,PeptideUniqueToGene,ExperimentDesc,ExpID,PubmedID,ScoreType,IdentScore,LocProb,Log2FChange,PQ-val,QuantSig,PEP,MassErrorPPM
EKEIVELFR,ub,K,131,true,"Arabidopsis ubiquitination COFRADIC",40,26744219,"MaxQuant Score",113.6200000,1.0000000,,,,0.00016169999435078,-0.0810000
KVQAQLR,ub,K,139,true,"Arabidopsis ubiquitination COFRADIC",40,26744219,"MaxQuant Score",139.2700000,1.0000000,,,,0.0040000001899898,-0.6920000
KHSGEQSKR,ub,K,187,true,"Arabidopsis ubiquitination COFRADIC",40,26744219,"MaxQuant Score",146.7100000,1.0000000,,,,2.2439999156632E-6,-0.1350000
QVSKFSSQGEVQGDTVDKQDR,ub,K,206,true,"Arabidopsis ubiquitination COFRADIC",40,26744219,"MaxQuant Score",47.4990000,1.0000000,,,,2.0010000412185E-7,-0.3340000
TGNLVTSGNKDNNASSFTR,ub,K,219,true,"Arabidopsis ubiquitination COFRADIC",40,26744219,"MaxQuant Score",92.4740000,1.0000000,,,,2.3560000544805E-20,0.1300000
KAELVELLGSDSS,ph,S,398,true,"Tissue atlas Arabidopsis - ProteomicsDB",114,32188942,"MaxQuant score",167.0300000,0.9981250,,,,5.1510097931278E-15,
KAELVELLGSDSS,ph,S,400,true,"ABA-induced protein phosphorylation",35,20733066,,,,,,,,
KAELVELLGSDSS,ph,S,400,true,"Phosphoproteome ethylene-regulated time response",46,24043427,"MASCOT Score",62.9400000,,,,,,3.8455000
KAELVELLGSDSS,ph,S,400,true,"srk2dei ABA signaling phopshoproteomics",83,23572148,"MASCOT Score",73.0000000,,,,,,0.0001000
KAELVELLGSDSS,ph,S,400,true,"SnRK2 protein kinase substrates",85,23776212,XCorr,4.0641265,0.9810000,,,,1.9494800653774E-5,
KAELVELLGSDSS,ph,S,400,true,"atm and atr DNA damage response",88,25561503,"MASCOT Score",87.0000000,0.9550000,,,,,-0.6600000
KAELVELLGSDSS,ph,S,400,true,"TOR Kinase and ABA Receptor",100,29290610,XCorr,4.8322902,0.9424000,,,,1.811000061025E-7,
KAELVELLGSDSS,ph,S,400,true,"Tissue atlas Arabidopsis - ProteomicsDB",114,32188942,"MaxQuant score",318.4900000,0.9899920,,,,0,
AELVELLGSDSS,ph,S,400,true,"ABA-induced protein phosphorylation",35,20733066,,,,,,,,
AELVELLGSDSS,ph,S,400,true,"Chloroplast kinase substrates",60,19376835,"MASCOT Score",31.8300000,,,,,,-0.4877690
AELVELLGSDSS,ph,S,400,true,"SnRK2 protein kinase substrates",85,23776212,XCorr,3.6148613,0.9740000,,,,1.2669600091275E-10,
AELVELLGSDSS,ph,S,400,true,"atm and atr DNA damage response",88,25561503,"MASCOT Score",57.0000000,0.9580000,,,,,0.1200000
AELVELLGSDSS,ph,S,400,true,"Brassinosteroid-Regulated Phosphorylation Dynamics",94,26187819,"MaxQuant Score",203.8200000,0.9930000,,,,9.0470003349168E-34,1.0760000
AELVELLGSDSS,ph,S,400,true,"TOR Kinase and ABA Receptor",100,29290610,XCorr,4.3341670,0.9502000,,,,1.7059999663616E-5,
KAELVELLGSDSS,ph,S,401,true,"Phosphoproteome ethylene-regulated time response",46,24043427,"MASCOT Score",77.1900000,,,,,,4.8560000
KAELVELLGSDSS,ph,S,401,true,"Col-0 callus - FC Col-0 vs. Col-0 Xray",111a,31410901,,71.8700000,,-0.8134031,0.0403924,YES,,0.8661536
KAELVELLGSDSS,ph,S,401,true,"Col-0 X-ray callus - FC Col-0 vs. Col-0 Xray",111b,31410901,,71.8700000,,-0.8134031,0.0403924,YES,,0.8661536
KAELVELLGSDSS,ph,S,401,true,"atm callus - FC atm vs. atm Xray",111c,31410901,,71.8700000,,0.0274631,0.9517610,NO,,0.8661536
KAELVELLGSDSS,ph,S,401,true,"atm-3 X-ray callus - FC atm vs. atm Xray",111d,31410901,,71.8700000,,0.0274631,0.9517610,NO,,0.8661536
KAELVELLGSDSS,ph,S,401,true,"Tissue atlas Arabidopsis - ProteomicsDB",114,32188942,"MaxQuant score",270.2100000,0.8834500,,,,0,
AELVELLGSDSS,ph,S,401,true,"atm and atr DNA damage response",88,25561503,"MASCOT Score",53.0000000,0.9640000,,,,,0.5500000
